Download build/CMakeFiles/CMakeConfigureLog.yaml from camenduru/thrust: direct link, hf CLI and curl.
- Browser
- Download file 128 kB
-
https://huggingface.co/camenduru/thrust/resolve/main/build/CMakeFiles/CMakeConfigureLog.yaml
- Command line
-
hf download hf://camenduru/thrust/build/CMakeFiles/CMakeConfigureLog.yaml
-
curl -L -o CMakeConfigureLog.yaml https://huggingface.co/camenduru/thrust/resolve/main/build/CMakeFiles/CMakeConfigureLog.yaml
128 kB
| events: | |
| - | |
| kind: "message-v1" | |
| backtrace: | |
| - "/usr/share/cmake-3.26/Modules/CMakeDetermineSystem.cmake:204 (message)" | |
| - "CMakeLists.txt:12 (project)" | |
| message: | | |
| The system is: Linux - 5.15.0-67-generic - x86_64 | |
| - | |
| kind: "message-v1" | |
| backtrace: | |
| - "/usr/share/cmake-3.26/Modules/CMakeDetermineCompilerId.cmake:17 (message)" | |
| - "/usr/share/cmake-3.26/Modules/CMakeDetermineCompilerId.cmake:64 (__determine_compiler_id_test)" | |
| - "/usr/share/cmake-3.26/Modules/CMakeDetermineCXXCompiler.cmake:126 (CMAKE_DETERMINE_COMPILER_ID)" | |
| - "CMakeLists.txt:48 (enable_language)" | |
| message: | | |
| Compiling the CXX compiler identification source file "CMakeCXXCompilerId.cpp" succeeded. | |
| Compiler: /usr/bin/c++ | |
| Build flags: | |
| Id flags: | |
| The output was: | |
| 0 | |
| Compilation of the CXX compiler identification source "CMakeCXXCompilerId.cpp" produced "a.out" | |
| The CXX compiler identification is GNU, found in: | |
| /home/ubuntu/thrust/build/CMakeFiles/3.26.4/CompilerIdCXX/a.out | |
| - | |
| kind: "try_compile-v1" | |
| backtrace: | |
| - "/usr/share/cmake-3.26/Modules/CMakeDetermineCompilerABI.cmake:57 (try_compile)" | |
| - "/usr/share/cmake-3.26/Modules/CMakeTestCXXCompiler.cmake:26 (CMAKE_DETERMINE_COMPILER_ABI)" | |
| - "CMakeLists.txt:48 (enable_language)" | |
| checks: | |
| - "Detecting CXX compiler ABI info" | |
| directories: | |
| source: "/home/ubuntu/thrust/build/CMakeFiles/CMakeScratch/TryCompile-SqX9pD" | |
| binary: "/home/ubuntu/thrust/build/CMakeFiles/CMakeScratch/TryCompile-SqX9pD" | |
| cmakeVariables: | |
| CMAKE_CXX_FLAGS: "" | |
| CMAKE_CXX_FLAGS_DEBUG: "-g" | |
| CMAKE_EXE_LINKER_FLAGS: "" | |
| buildResult: | |
| variable: "CMAKE_CXX_ABI_COMPILED" | |
| cached: true | |
| stdout: | | |
| Change Dir: /home/ubuntu/thrust/build/CMakeFiles/CMakeScratch/TryCompile-SqX9pD | |
| Run Build Command(s):/usr/bin/cmake -E env VERBOSE=1 /usr/bin/make -f Makefile cmTC_becbb/fast && /usr/bin/make -f CMakeFiles/cmTC_becbb.dir/build.make CMakeFiles/cmTC_becbb.dir/build | |
| make[1]: Entering directory '/home/ubuntu/thrust/build/CMakeFiles/CMakeScratch/TryCompile-SqX9pD' | |
| Building CXX object CMakeFiles/cmTC_becbb.dir/CMakeCXXCompilerABI.cpp.o | |
| /usr/bin/c++ -v -o CMakeFiles/cmTC_becbb.dir/CMakeCXXCompilerABI.cpp.o -c /usr/share/cmake-3.26/Modules/CMakeCXXCompilerABI.cpp | |
| Using built-in specs. | |
| COLLECT_GCC=/usr/bin/c++ | |
| OFFLOAD_TARGET_NAMES=nvptx-none:hsa | |
| OFFLOAD_TARGET_DEFAULT=1 | |
| Target: x86_64-linux-gnu | |
| Configured with: ../src/configure -v --with-pkgversion='Ubuntu 9.4.0-1ubuntu1~20.04.1' --with-bugurl=file:///usr/share/doc/gcc-9/README.Bugs --enable-languages=c,ada,c++,go,brig,d,fortran,objc,obj-c++,gm2 --prefix=/usr --with-gcc-major-version-only --program-suffix=-9 --program-prefix=x86_64-linux-gnu- --enable-shared --enable-linker-build-id --libexecdir=/usr/lib --without-included-gettext --enable-threads=posix --libdir=/usr/lib --enable-nls --enable-clocale=gnu --enable-libstdcxx-debug --enable-libstdcxx-time=yes --with-default-libstdcxx-abi=new --enable-gnu-unique-object --disable-vtable-verify --enable-plugin --enable-default-pie --with-system-zlib --with-target-system-zlib=auto --enable-objc-gc=auto --enable-multiarch --disable-werror --with-arch-32=i686 --with-abi=m64 --with-multilib-list=m32,m64,mx32 --enable-multilib --with-tune=generic --enable-offload-targets=nvptx-none=/build/gcc-9-Av3uEd/gcc-9-9.4.0/debian/tmp-nvptx/usr,hsa --without-cuda-driver --enable-checking=release --build=x86_64-linux-gnu --host=x86_64-linux-gnu --target=x86_64-linux-gnu | |
| Thread model: posix | |
| gcc version 9.4.0 (Ubuntu 9.4.0-1ubuntu1~20.04.1) | |
| COLLECT_GCC_OPTIONS='-v' '-o' 'CMakeFiles/cmTC_becbb.dir/CMakeCXXCompilerABI.cpp.o' '-c' '-shared-libgcc' '-mtune=generic' '-march=x86-64' | |
| /usr/lib/gcc/x86_64-linux-gnu/9/cc1plus -quiet -v -imultiarch x86_64-linux-gnu -D_GNU_SOURCE /usr/share/cmake-3.26/Modules/CMakeCXXCompilerABI.cpp -quiet -dumpbase CMakeCXXCompilerABI.cpp -mtune=generic -march=x86-64 -auxbase-strip CMakeFiles/cmTC_becbb.dir/CMakeCXXCompilerABI.cpp.o -version -fasynchronous-unwind-tables -fstack-protector-strong -Wformat -Wformat-security -fstack-clash-protection -fcf-protection -o /tmp/cchOK4ei.s | |
| GNU C++14 (Ubuntu 9.4.0-1ubuntu1~20.04.1) version 9.4.0 (x86_64-linux-gnu) | |
| compiled by GNU C version 9.4.0, GMP version 6.2.0, MPFR version 4.0.2, MPC version 1.1.0, isl version isl-0.22.1-GMP | |
| GGC heuristics: --param ggc-min-expand=100 --param ggc-min-heapsize=131072 | |
| ignoring duplicate directory "/usr/include/x86_64-linux-gnu/c++/9" | |
| ignoring nonexistent directory "/usr/local/include/x86_64-linux-gnu" | |
| ignoring nonexistent directory "/usr/lib/gcc/x86_64-linux-gnu/9/include-fixed" | |
| ignoring nonexistent directory "/usr/lib/gcc/x86_64-linux-gnu/9/../../../../x86_64-linux-gnu/include" | |
| #include "..." search starts here: | |
| #include <...> search starts here: | |
| /usr/include/c++/9 | |
| /usr/include/x86_64-linux-gnu/c++/9 | |
| /usr/include/c++/9/backward | |
| /usr/lib/gcc/x86_64-linux-gnu/9/include | |
| /usr/local/include | |
| /usr/include/x86_64-linux-gnu | |
| /usr/include | |
| End of search list. | |
| GNU C++14 (Ubuntu 9.4.0-1ubuntu1~20.04.1) version 9.4.0 (x86_64-linux-gnu) | |
| compiled by GNU C version 9.4.0, GMP version 6.2.0, MPFR version 4.0.2, MPC version 1.1.0, isl version isl-0.22.1-GMP | |
| GGC heuristics: --param ggc-min-expand=100 --param ggc-min-heapsize=131072 | |
| Compiler executable checksum: 65fe925b83d3956b533de4aaba7dace0 | |
| COLLECT_GCC_OPTIONS='-v' '-o' 'CMakeFiles/cmTC_becbb.dir/CMakeCXXCompilerABI.cpp.o' '-c' '-shared-libgcc' '-mtune=generic' '-march=x86-64' | |
| as -v --64 -o CMakeFiles/cmTC_becbb.dir/CMakeCXXCompilerABI.cpp.o /tmp/cchOK4ei.s | |
| GNU assembler version 2.34 (x86_64-linux-gnu) using BFD version (GNU Binutils for Ubuntu) 2.34 | |
| COMPILER_PATH=/usr/lib/gcc/x86_64-linux-gnu/9/:/usr/lib/gcc/x86_64-linux-gnu/9/:/usr/lib/gcc/x86_64-linux-gnu/:/usr/lib/gcc/x86_64-linux-gnu/9/:/usr/lib/gcc/x86_64-linux-gnu/ | |
| LIBRARY_PATH=/usr/lib/gcc/x86_64-linux-gnu/9/:/usr/lib/gcc/x86_64-linux-gnu/9/../../../x86_64-linux-gnu/:/usr/lib/gcc/x86_64-linux-gnu/9/../../../../lib/:/lib/x86_64-linux-gnu/:/lib/../lib/:/usr/lib/x86_64-linux-gnu/:/usr/lib/../lib/:/usr/lib/gcc/x86_64-linux-gnu/9/../../../:/lib/:/usr/lib/ | |
| COLLECT_GCC_OPTIONS='-v' '-o' 'CMakeFiles/cmTC_becbb.dir/CMakeCXXCompilerABI.cpp.o' '-c' '-shared-libgcc' '-mtune=generic' '-march=x86-64' | |
| Linking CXX executable cmTC_becbb | |
| /usr/bin/cmake -E cmake_link_script CMakeFiles/cmTC_becbb.dir/link.txt --verbose=1 | |
| /usr/bin/c++ -v CMakeFiles/cmTC_becbb.dir/CMakeCXXCompilerABI.cpp.o -o cmTC_becbb | |
| Using built-in specs. | |
| COLLECT_GCC=/usr/bin/c++ | |
| COLLECT_LTO_WRAPPER=/usr/lib/gcc/x86_64-linux-gnu/9/lto-wrapper | |
| OFFLOAD_TARGET_NAMES=nvptx-none:hsa | |
| OFFLOAD_TARGET_DEFAULT=1 | |
| Target: x86_64-linux-gnu | |
| Configured with: ../src/configure -v --with-pkgversion='Ubuntu 9.4.0-1ubuntu1~20.04.1' --with-bugurl=file:///usr/share/doc/gcc-9/README.Bugs --enable-languages=c,ada,c++,go,brig,d,fortran,objc,obj-c++,gm2 --prefix=/usr --with-gcc-major-version-only --program-suffix=-9 --program-prefix=x86_64-linux-gnu- --enable-shared --enable-linker-build-id --libexecdir=/usr/lib --without-included-gettext --enable-threads=posix --libdir=/usr/lib --enable-nls --enable-clocale=gnu --enable-libstdcxx-debug --enable-libstdcxx-time=yes --with-default-libstdcxx-abi=new --enable-gnu-unique-object --disable-vtable-verify --enable-plugin --enable-default-pie --with-system-zlib --with-target-system-zlib=auto --enable-objc-gc=auto --enable-multiarch --disable-werror --with-arch-32=i686 --with-abi=m64 --with-multilib-list=m32,m64,mx32 --enable-multilib --with-tune=generic --enable-offload-targets=nvptx-none=/build/gcc-9-Av3uEd/gcc-9-9.4.0/debian/tmp-nvptx/usr,hsa --without-cuda-driver --enable-checking=release --build=x86_64-linux-gnu --host=x86_64-linux-gnu --target=x86_64-linux-gnu | |
| Thread model: posix | |
| gcc version 9.4.0 (Ubuntu 9.4.0-1ubuntu1~20.04.1) | |
| COMPILER_PATH=/usr/lib/gcc/x86_64-linux-gnu/9/:/usr/lib/gcc/x86_64-linux-gnu/9/:/usr/lib/gcc/x86_64-linux-gnu/:/usr/lib/gcc/x86_64-linux-gnu/9/:/usr/lib/gcc/x86_64-linux-gnu/ | |
| LIBRARY_PATH=/usr/lib/gcc/x86_64-linux-gnu/9/:/usr/lib/gcc/x86_64-linux-gnu/9/../../../x86_64-linux-gnu/:/usr/lib/gcc/x86_64-linux-gnu/9/../../../../lib/:/lib/x86_64-linux-gnu/:/lib/../lib/:/usr/lib/x86_64-linux-gnu/:/usr/lib/../lib/:/usr/lib/gcc/x86_64-linux-gnu/9/../../../:/lib/:/usr/lib/ | |
| COLLECT_GCC_OPTIONS='-v' '-o' 'cmTC_becbb' '-shared-libgcc' '-mtune=generic' '-march=x86-64' | |
| /usr/lib/gcc/x86_64-linux-gnu/9/collect2 -plugin /usr/lib/gcc/x86_64-linux-gnu/9/liblto_plugin.so -plugin-opt=/usr/lib/gcc/x86_64-linux-gnu/9/lto-wrapper -plugin-opt=-fresolution=/tmp/ccJnSEoB.res -plugin-opt=-pass-through=-lgcc_s -plugin-opt=-pass-through=-lgcc -plugin-opt=-pass-through=-lc -plugin-opt=-pass-through=-lgcc_s -plugin-opt=-pass-through=-lgcc --build-id --eh-frame-hdr -m elf_x86_64 --hash-style=gnu --as-needed -dynamic-linker /lib64/ld-linux-x86-64.so.2 -pie -z now -z relro -o cmTC_becbb /usr/lib/gcc/x86_64-linux-gnu/9/../../../x86_64-linux-gnu/Scrt1.o /usr/lib/gcc/x86_64-linux-gnu/9/../../../x86_64-linux-gnu/crti.o /usr/lib/gcc/x86_64-linux-gnu/9/crtbeginS.o -L/usr/lib/gcc/x86_64-linux-gnu/9 -L/usr/lib/gcc/x86_64-linux-gnu/9/../../../x86_64-linux-gnu -L/usr/lib/gcc/x86_64-linux-gnu/9/../../../../lib -L/lib/x86_64-linux-gnu -L/lib/../lib -L/usr/lib/x86_64-linux-gnu -L/usr/lib/../lib -L/usr/lib/gcc/x86_64-linux-gnu/9/../../.. CMakeFiles/cmTC_becbb.dir/CMakeCXXCompilerABI.cpp.o -lstdc++ -lm -lgcc_s -lgcc -lc -lgcc_s -lgcc /usr/lib/gcc/x86_64-linux-gnu/9/crtendS.o /usr/lib/gcc/x86_64-linux-gnu/9/../../../x86_64-linux-gnu/crtn.o | |
| COLLECT_GCC_OPTIONS='-v' '-o' 'cmTC_becbb' '-shared-libgcc' '-mtune=generic' '-march=x86-64' | |
| make[1]: Leaving directory '/home/ubuntu/thrust/build/CMakeFiles/CMakeScratch/TryCompile-SqX9pD' | |
| exitCode: 0 | |
| - | |
| kind: "message-v1" | |
| backtrace: | |
| - "/usr/share/cmake-3.26/Modules/CMakeDetermineCompilerABI.cmake:127 (message)" | |
| - "/usr/share/cmake-3.26/Modules/CMakeTestCXXCompiler.cmake:26 (CMAKE_DETERMINE_COMPILER_ABI)" | |
| - "CMakeLists.txt:48 (enable_language)" | |
| message: | | |
| Parsed CXX implicit include dir info: rv=done | |
| found start of include info | |
| found start of implicit include info | |
| add: [/usr/include/c++/9] | |
| add: [/usr/include/x86_64-linux-gnu/c++/9] | |
| add: [/usr/include/c++/9/backward] | |
| add: [/usr/lib/gcc/x86_64-linux-gnu/9/include] | |
| add: [/usr/local/include] | |
| add: [/usr/include/x86_64-linux-gnu] | |
| add: [/usr/include] | |
| end of search list found | |
| collapse include dir [/usr/include/c++/9] ==> [/usr/include/c++/9] | |
| collapse include dir [/usr/include/x86_64-linux-gnu/c++/9] ==> [/usr/include/x86_64-linux-gnu/c++/9] | |
| collapse include dir [/usr/include/c++/9/backward] ==> [/usr/include/c++/9/backward] | |
| collapse include dir [/usr/lib/gcc/x86_64-linux-gnu/9/include] ==> [/usr/lib/gcc/x86_64-linux-gnu/9/include] | |
| collapse include dir [/usr/local/include] ==> [/usr/local/include] | |
| collapse include dir [/usr/include/x86_64-linux-gnu] ==> [/usr/include/x86_64-linux-gnu] | |
| collapse include dir [/usr/include] ==> [/usr/include] | |
| implicit include dirs: [/usr/include/c++/9;/usr/include/x86_64-linux-gnu/c++/9;/usr/include/c++/9/backward;/usr/lib/gcc/x86_64-linux-gnu/9/include;/usr/local/include;/usr/include/x86_64-linux-gnu;/usr/include] | |
| - | |
| kind: "message-v1" | |
| backtrace: | |
| - "/usr/share/cmake-3.26/Modules/CMakeDetermineCompilerABI.cmake:152 (message)" | |
| - "/usr/share/cmake-3.26/Modules/CMakeTestCXXCompiler.cmake:26 (CMAKE_DETERMINE_COMPILER_ABI)" | |
| - "CMakeLists.txt:48 (enable_language)" | |
| message: | | |
| Parsed CXX implicit link information: | |
| link line regex: [^( *|.*[/\\])(ld|CMAKE_LINK_STARTFILE-NOTFOUND|([^/\\]+-)?ld|collect2)[^/\\]*( |$)] | |
| ignore line: [Change Dir: /home/ubuntu/thrust/build/CMakeFiles/CMakeScratch/TryCompile-SqX9pD] | |
| ignore line: [] | |
| ignore line: [Run Build Command(s):/usr/bin/cmake -E env VERBOSE=1 /usr/bin/make -f Makefile cmTC_becbb/fast && /usr/bin/make -f CMakeFiles/cmTC_becbb.dir/build.make CMakeFiles/cmTC_becbb.dir/build] | |
| ignore line: [make[1]: Entering directory '/home/ubuntu/thrust/build/CMakeFiles/CMakeScratch/TryCompile-SqX9pD'] | |
| ignore line: [Building CXX object CMakeFiles/cmTC_becbb.dir/CMakeCXXCompilerABI.cpp.o] | |
| ignore line: [/usr/bin/c++ -v -o CMakeFiles/cmTC_becbb.dir/CMakeCXXCompilerABI.cpp.o -c /usr/share/cmake-3.26/Modules/CMakeCXXCompilerABI.cpp] | |
| ignore line: [Using built-in specs.] | |
| ignore line: [COLLECT_GCC=/usr/bin/c++] | |
| ignore line: [OFFLOAD_TARGET_NAMES=nvptx-none:hsa] | |
| ignore line: [OFFLOAD_TARGET_DEFAULT=1] | |
| ignore line: [Target: x86_64-linux-gnu] | |
| ignore line: [Configured with: ../src/configure -v --with-pkgversion='Ubuntu 9.4.0-1ubuntu1~20.04.1' --with-bugurl=file:///usr/share/doc/gcc-9/README.Bugs --enable-languages=c ada c++ go brig d fortran objc obj-c++ gm2 --prefix=/usr --with-gcc-major-version-only --program-suffix=-9 --program-prefix=x86_64-linux-gnu- --enable-shared --enable-linker-build-id --libexecdir=/usr/lib --without-included-gettext --enable-threads=posix --libdir=/usr/lib --enable-nls --enable-clocale=gnu --enable-libstdcxx-debug --enable-libstdcxx-time=yes --with-default-libstdcxx-abi=new --enable-gnu-unique-object --disable-vtable-verify --enable-plugin --enable-default-pie --with-system-zlib --with-target-system-zlib=auto --enable-objc-gc=auto --enable-multiarch --disable-werror --with-arch-32=i686 --with-abi=m64 --with-multilib-list=m32 m64 mx32 --enable-multilib --with-tune=generic --enable-offload-targets=nvptx-none=/build/gcc-9-Av3uEd/gcc-9-9.4.0/debian/tmp-nvptx/usr hsa --without-cuda-driver --enable-checking=release --build=x86_64-linux-gnu --host=x86_64-linux-gnu --target=x86_64-linux-gnu] | |
| ignore line: [Thread model: posix] | |
| ignore line: [gcc version 9.4.0 (Ubuntu 9.4.0-1ubuntu1~20.04.1) ] | |
| ignore line: [COLLECT_GCC_OPTIONS='-v' '-o' 'CMakeFiles/cmTC_becbb.dir/CMakeCXXCompilerABI.cpp.o' '-c' '-shared-libgcc' '-mtune=generic' '-march=x86-64'] | |
| ignore line: [ /usr/lib/gcc/x86_64-linux-gnu/9/cc1plus -quiet -v -imultiarch x86_64-linux-gnu -D_GNU_SOURCE /usr/share/cmake-3.26/Modules/CMakeCXXCompilerABI.cpp -quiet -dumpbase CMakeCXXCompilerABI.cpp -mtune=generic -march=x86-64 -auxbase-strip CMakeFiles/cmTC_becbb.dir/CMakeCXXCompilerABI.cpp.o -version -fasynchronous-unwind-tables -fstack-protector-strong -Wformat -Wformat-security -fstack-clash-protection -fcf-protection -o /tmp/cchOK4ei.s] | |
| ignore line: [GNU C++14 (Ubuntu 9.4.0-1ubuntu1~20.04.1) version 9.4.0 (x86_64-linux-gnu)] | |
| ignore line: [ compiled by GNU C version 9.4.0 GMP version 6.2.0 MPFR version 4.0.2 MPC version 1.1.0 isl version isl-0.22.1-GMP] | |
| ignore line: [] | |
| ignore line: [GGC heuristics: --param ggc-min-expand=100 --param ggc-min-heapsize=131072] | |
| ignore line: [ignoring duplicate directory "/usr/include/x86_64-linux-gnu/c++/9"] | |
| ignore line: [ignoring nonexistent directory "/usr/local/include/x86_64-linux-gnu"] | |
| ignore line: [ignoring nonexistent directory "/usr/lib/gcc/x86_64-linux-gnu/9/include-fixed"] | |
| ignore line: [ignoring nonexistent directory "/usr/lib/gcc/x86_64-linux-gnu/9/../../../../x86_64-linux-gnu/include"] | |
| ignore line: [#include "..." search starts here:] | |
| ignore line: [#include <...> search starts here:] | |
| ignore line: [ /usr/include/c++/9] | |
| ignore line: [ /usr/include/x86_64-linux-gnu/c++/9] | |
| ignore line: [ /usr/include/c++/9/backward] | |
| ignore line: [ /usr/lib/gcc/x86_64-linux-gnu/9/include] | |
| ignore line: [ /usr/local/include] | |
| ignore line: [ /usr/include/x86_64-linux-gnu] | |
| ignore line: [ /usr/include] | |
| ignore line: [End of search list.] | |
| ignore line: [GNU C++14 (Ubuntu 9.4.0-1ubuntu1~20.04.1) version 9.4.0 (x86_64-linux-gnu)] | |
| ignore line: [ compiled by GNU C version 9.4.0 GMP version 6.2.0 MPFR version 4.0.2 MPC version 1.1.0 isl version isl-0.22.1-GMP] | |
| ignore line: [] | |
| ignore line: [GGC heuristics: --param ggc-min-expand=100 --param ggc-min-heapsize=131072] | |
| ignore line: [Compiler executable checksum: 65fe925b83d3956b533de4aaba7dace0] | |
| ignore line: [COLLECT_GCC_OPTIONS='-v' '-o' 'CMakeFiles/cmTC_becbb.dir/CMakeCXXCompilerABI.cpp.o' '-c' '-shared-libgcc' '-mtune=generic' '-march=x86-64'] | |
| ignore line: [ as -v --64 -o CMakeFiles/cmTC_becbb.dir/CMakeCXXCompilerABI.cpp.o /tmp/cchOK4ei.s] | |
| ignore line: [GNU assembler version 2.34 (x86_64-linux-gnu) using BFD version (GNU Binutils for Ubuntu) 2.34] | |
| ignore line: [COMPILER_PATH=/usr/lib/gcc/x86_64-linux-gnu/9/:/usr/lib/gcc/x86_64-linux-gnu/9/:/usr/lib/gcc/x86_64-linux-gnu/:/usr/lib/gcc/x86_64-linux-gnu/9/:/usr/lib/gcc/x86_64-linux-gnu/] | |
| ignore line: [LIBRARY_PATH=/usr/lib/gcc/x86_64-linux-gnu/9/:/usr/lib/gcc/x86_64-linux-gnu/9/../../../x86_64-linux-gnu/:/usr/lib/gcc/x86_64-linux-gnu/9/../../../../lib/:/lib/x86_64-linux-gnu/:/lib/../lib/:/usr/lib/x86_64-linux-gnu/:/usr/lib/../lib/:/usr/lib/gcc/x86_64-linux-gnu/9/../../../:/lib/:/usr/lib/] | |
| ignore line: [COLLECT_GCC_OPTIONS='-v' '-o' 'CMakeFiles/cmTC_becbb.dir/CMakeCXXCompilerABI.cpp.o' '-c' '-shared-libgcc' '-mtune=generic' '-march=x86-64'] | |
| ignore line: [Linking CXX executable cmTC_becbb] | |
| ignore line: [/usr/bin/cmake -E cmake_link_script CMakeFiles/cmTC_becbb.dir/link.txt --verbose=1] | |
| ignore line: [/usr/bin/c++ -v CMakeFiles/cmTC_becbb.dir/CMakeCXXCompilerABI.cpp.o -o cmTC_becbb ] | |
| ignore line: [Using built-in specs.] | |
| ignore line: [COLLECT_GCC=/usr/bin/c++] | |
| ignore line: [COLLECT_LTO_WRAPPER=/usr/lib/gcc/x86_64-linux-gnu/9/lto-wrapper] | |
| ignore line: [OFFLOAD_TARGET_NAMES=nvptx-none:hsa] | |
| ignore line: [OFFLOAD_TARGET_DEFAULT=1] | |
| ignore line: [Target: x86_64-linux-gnu] | |
| ignore line: [Configured with: ../src/configure -v --with-pkgversion='Ubuntu 9.4.0-1ubuntu1~20.04.1' --with-bugurl=file:///usr/share/doc/gcc-9/README.Bugs --enable-languages=c ada c++ go brig d fortran objc obj-c++ gm2 --prefix=/usr --with-gcc-major-version-only --program-suffix=-9 --program-prefix=x86_64-linux-gnu- --enable-shared --enable-linker-build-id --libexecdir=/usr/lib --without-included-gettext --enable-threads=posix --libdir=/usr/lib --enable-nls --enable-clocale=gnu --enable-libstdcxx-debug --enable-libstdcxx-time=yes --with-default-libstdcxx-abi=new --enable-gnu-unique-object --disable-vtable-verify --enable-plugin --enable-default-pie --with-system-zlib --with-target-system-zlib=auto --enable-objc-gc=auto --enable-multiarch --disable-werror --with-arch-32=i686 --with-abi=m64 --with-multilib-list=m32 m64 mx32 --enable-multilib --with-tune=generic --enable-offload-targets=nvptx-none=/build/gcc-9-Av3uEd/gcc-9-9.4.0/debian/tmp-nvptx/usr hsa --without-cuda-driver --enable-checking=release --build=x86_64-linux-gnu --host=x86_64-linux-gnu --target=x86_64-linux-gnu] | |
| ignore line: [Thread model: posix] | |
| ignore line: [gcc version 9.4.0 (Ubuntu 9.4.0-1ubuntu1~20.04.1) ] | |
| ignore line: [COMPILER_PATH=/usr/lib/gcc/x86_64-linux-gnu/9/:/usr/lib/gcc/x86_64-linux-gnu/9/:/usr/lib/gcc/x86_64-linux-gnu/:/usr/lib/gcc/x86_64-linux-gnu/9/:/usr/lib/gcc/x86_64-linux-gnu/] | |
| ignore line: [LIBRARY_PATH=/usr/lib/gcc/x86_64-linux-gnu/9/:/usr/lib/gcc/x86_64-linux-gnu/9/../../../x86_64-linux-gnu/:/usr/lib/gcc/x86_64-linux-gnu/9/../../../../lib/:/lib/x86_64-linux-gnu/:/lib/../lib/:/usr/lib/x86_64-linux-gnu/:/usr/lib/../lib/:/usr/lib/gcc/x86_64-linux-gnu/9/../../../:/lib/:/usr/lib/] | |
| ignore line: [COLLECT_GCC_OPTIONS='-v' '-o' 'cmTC_becbb' '-shared-libgcc' '-mtune=generic' '-march=x86-64'] | |
| link line: [ /usr/lib/gcc/x86_64-linux-gnu/9/collect2 -plugin /usr/lib/gcc/x86_64-linux-gnu/9/liblto_plugin.so -plugin-opt=/usr/lib/gcc/x86_64-linux-gnu/9/lto-wrapper -plugin-opt=-fresolution=/tmp/ccJnSEoB.res -plugin-opt=-pass-through=-lgcc_s -plugin-opt=-pass-through=-lgcc -plugin-opt=-pass-through=-lc -plugin-opt=-pass-through=-lgcc_s -plugin-opt=-pass-through=-lgcc --build-id --eh-frame-hdr -m elf_x86_64 --hash-style=gnu --as-needed -dynamic-linker /lib64/ld-linux-x86-64.so.2 -pie -z now -z relro -o cmTC_becbb /usr/lib/gcc/x86_64-linux-gnu/9/../../../x86_64-linux-gnu/Scrt1.o /usr/lib/gcc/x86_64-linux-gnu/9/../../../x86_64-linux-gnu/crti.o /usr/lib/gcc/x86_64-linux-gnu/9/crtbeginS.o -L/usr/lib/gcc/x86_64-linux-gnu/9 -L/usr/lib/gcc/x86_64-linux-gnu/9/../../../x86_64-linux-gnu -L/usr/lib/gcc/x86_64-linux-gnu/9/../../../../lib -L/lib/x86_64-linux-gnu -L/lib/../lib -L/usr/lib/x86_64-linux-gnu -L/usr/lib/../lib -L/usr/lib/gcc/x86_64-linux-gnu/9/../../.. CMakeFiles/cmTC_becbb.dir/CMakeCXXCompilerABI.cpp.o -lstdc++ -lm -lgcc_s -lgcc -lc -lgcc_s -lgcc /usr/lib/gcc/x86_64-linux-gnu/9/crtendS.o /usr/lib/gcc/x86_64-linux-gnu/9/../../../x86_64-linux-gnu/crtn.o] | |
| arg [/usr/lib/gcc/x86_64-linux-gnu/9/collect2] ==> ignore | |
| arg [-plugin] ==> ignore | |
| arg [/usr/lib/gcc/x86_64-linux-gnu/9/liblto_plugin.so] ==> ignore | |
| arg [-plugin-opt=/usr/lib/gcc/x86_64-linux-gnu/9/lto-wrapper] ==> ignore | |
| arg [-plugin-opt=-fresolution=/tmp/ccJnSEoB.res] ==> ignore | |
| arg [-plugin-opt=-pass-through=-lgcc_s] ==> ignore | |
| arg [-plugin-opt=-pass-through=-lgcc] ==> ignore | |
| arg [-plugin-opt=-pass-through=-lc] ==> ignore | |
| arg [-plugin-opt=-pass-through=-lgcc_s] ==> ignore | |
| arg [-plugin-opt=-pass-through=-lgcc] ==> ignore | |
| arg [--build-id] ==> ignore | |
| arg [--eh-frame-hdr] ==> ignore | |
| arg [-m] ==> ignore | |
| arg [elf_x86_64] ==> ignore | |
| arg [--hash-style=gnu] ==> ignore | |
| arg [--as-needed] ==> ignore | |
| arg [-dynamic-linker] ==> ignore | |
| arg [/lib64/ld-linux-x86-64.so.2] ==> ignore | |
| arg [-pie] ==> ignore | |
| arg [-znow] ==> ignore | |
| arg [-zrelro] ==> ignore | |
| arg [-o] ==> ignore | |
| arg [cmTC_becbb] ==> ignore | |
| arg [/usr/lib/gcc/x86_64-linux-gnu/9/../../../x86_64-linux-gnu/Scrt1.o] ==> obj [/usr/lib/gcc/x86_64-linux-gnu/9/../../../x86_64-linux-gnu/Scrt1.o] | |
| arg [/usr/lib/gcc/x86_64-linux-gnu/9/../../../x86_64-linux-gnu/crti.o] ==> obj [/usr/lib/gcc/x86_64-linux-gnu/9/../../../x86_64-linux-gnu/crti.o] | |
| arg [/usr/lib/gcc/x86_64-linux-gnu/9/crtbeginS.o] ==> obj [/usr/lib/gcc/x86_64-linux-gnu/9/crtbeginS.o] | |
| arg [-L/usr/lib/gcc/x86_64-linux-gnu/9] ==> dir [/usr/lib/gcc/x86_64-linux-gnu/9] | |
| arg [-L/usr/lib/gcc/x86_64-linux-gnu/9/../../../x86_64-linux-gnu] ==> dir [/usr/lib/gcc/x86_64-linux-gnu/9/../../../x86_64-linux-gnu] | |
| arg [-L/usr/lib/gcc/x86_64-linux-gnu/9/../../../../lib] ==> dir [/usr/lib/gcc/x86_64-linux-gnu/9/../../../../lib] | |
| arg [-L/lib/x86_64-linux-gnu] ==> dir [/lib/x86_64-linux-gnu] | |
| arg [-L/lib/../lib] ==> dir [/lib/../lib] | |
| arg [-L/usr/lib/x86_64-linux-gnu] ==> dir [/usr/lib/x86_64-linux-gnu] | |
| arg [-L/usr/lib/../lib] ==> dir [/usr/lib/../lib] | |
| arg [-L/usr/lib/gcc/x86_64-linux-gnu/9/../../..] ==> dir [/usr/lib/gcc/x86_64-linux-gnu/9/../../..] | |
| arg [CMakeFiles/cmTC_becbb.dir/CMakeCXXCompilerABI.cpp.o] ==> ignore | |
| arg [-lstdc++] ==> lib [stdc++] | |
| arg [-lm] ==> lib [m] | |
| arg [-lgcc_s] ==> lib [gcc_s] | |
| arg [-lgcc] ==> lib [gcc] | |
| arg [-lc] ==> lib [c] | |
| arg [-lgcc_s] ==> lib [gcc_s] | |
| arg [-lgcc] ==> lib [gcc] | |
| arg [/usr/lib/gcc/x86_64-linux-gnu/9/crtendS.o] ==> obj [/usr/lib/gcc/x86_64-linux-gnu/9/crtendS.o] | |
| arg [/usr/lib/gcc/x86_64-linux-gnu/9/../../../x86_64-linux-gnu/crtn.o] ==> obj [/usr/lib/gcc/x86_64-linux-gnu/9/../../../x86_64-linux-gnu/crtn.o] | |
| collapse obj [/usr/lib/gcc/x86_64-linux-gnu/9/../../../x86_64-linux-gnu/Scrt1.o] ==> [/usr/lib/x86_64-linux-gnu/Scrt1.o] | |
| collapse obj [/usr/lib/gcc/x86_64-linux-gnu/9/../../../x86_64-linux-gnu/crti.o] ==> [/usr/lib/x86_64-linux-gnu/crti.o] | |
| collapse obj [/usr/lib/gcc/x86_64-linux-gnu/9/../../../x86_64-linux-gnu/crtn.o] ==> [/usr/lib/x86_64-linux-gnu/crtn.o] | |
| collapse library dir [/usr/lib/gcc/x86_64-linux-gnu/9] ==> [/usr/lib/gcc/x86_64-linux-gnu/9] | |
| collapse library dir [/usr/lib/gcc/x86_64-linux-gnu/9/../../../x86_64-linux-gnu] ==> [/usr/lib/x86_64-linux-gnu] | |
| collapse library dir [/usr/lib/gcc/x86_64-linux-gnu/9/../../../../lib] ==> [/usr/lib] | |
| collapse library dir [/lib/x86_64-linux-gnu] ==> [/lib/x86_64-linux-gnu] | |
| collapse library dir [/lib/../lib] ==> [/lib] | |
| collapse library dir [/usr/lib/x86_64-linux-gnu] ==> [/usr/lib/x86_64-linux-gnu] | |
| collapse library dir [/usr/lib/../lib] ==> [/usr/lib] | |
| collapse library dir [/usr/lib/gcc/x86_64-linux-gnu/9/../../..] ==> [/usr/lib] | |
| implicit libs: [stdc++;m;gcc_s;gcc;c;gcc_s;gcc] | |
| implicit objs: [/usr/lib/x86_64-linux-gnu/Scrt1.o;/usr/lib/x86_64-linux-gnu/crti.o;/usr/lib/gcc/x86_64-linux-gnu/9/crtbeginS.o;/usr/lib/gcc/x86_64-linux-gnu/9/crtendS.o;/usr/lib/x86_64-linux-gnu/crtn.o] | |
| implicit dirs: [/usr/lib/gcc/x86_64-linux-gnu/9;/usr/lib/x86_64-linux-gnu;/usr/lib;/lib/x86_64-linux-gnu;/lib] | |
| implicit fwks: [] | |
| - | |
| kind: "try_compile-v1" | |
| backtrace: | |
| - "/usr/share/cmake-3.26/Modules/Internal/CheckSourceCompiles.cmake:101 (try_compile)" | |
| - "/usr/share/cmake-3.26/Modules/Internal/CheckCompilerFlag.cmake:18 (cmake_check_source_compiles)" | |
| - "/usr/share/cmake-3.26/Modules/CheckCXXCompilerFlag.cmake:40 (cmake_check_compiler_flag)" | |
| - "cmake/AppendOptionIfAvailable.cmake:7 (check_cxx_compiler_flag)" | |
| - "cmake/ThrustBuildCompilerTargets.cmake:78 (append_option_if_available)" | |
| - "CMakeLists.txt:115 (thrust_build_compiler_targets)" | |
| checks: | |
| - "Performing Test CXX_FLAG__Werror" | |
| directories: | |
| source: "/home/ubuntu/thrust/build/CMakeFiles/CMakeScratch/TryCompile-V1cKEE" | |
| binary: "/home/ubuntu/thrust/build/CMakeFiles/CMakeScratch/TryCompile-V1cKEE" | |
| cmakeVariables: | |
| CMAKE_CXX_FLAGS: "" | |
| CMAKE_CXX_FLAGS_DEBUG: "-g" | |
| CMAKE_EXE_LINKER_FLAGS: "" | |
| buildResult: | |
| variable: "CXX_FLAG__Werror" | |
| cached: true | |
| stdout: | | |
| Change Dir: /home/ubuntu/thrust/build/CMakeFiles/CMakeScratch/TryCompile-V1cKEE | |
| Run Build Command(s):/usr/bin/cmake -E env VERBOSE=1 /usr/bin/make -f Makefile cmTC_a93db/fast && /usr/bin/make -f CMakeFiles/cmTC_a93db.dir/build.make CMakeFiles/cmTC_a93db.dir/build | |
| make[1]: Entering directory '/home/ubuntu/thrust/build/CMakeFiles/CMakeScratch/TryCompile-V1cKEE' | |
| Building CXX object CMakeFiles/cmTC_a93db.dir/src.cxx.o | |
| /usr/bin/c++ -DCXX_FLAG__Werror -Werror -o CMakeFiles/cmTC_a93db.dir/src.cxx.o -c /home/ubuntu/thrust/build/CMakeFiles/CMakeScratch/TryCompile-V1cKEE/src.cxx | |
| Linking CXX executable cmTC_a93db | |
| /usr/bin/cmake -E cmake_link_script CMakeFiles/cmTC_a93db.dir/link.txt --verbose=1 | |
| /usr/bin/c++ CMakeFiles/cmTC_a93db.dir/src.cxx.o -o cmTC_a93db | |
| make[1]: Leaving directory '/home/ubuntu/thrust/build/CMakeFiles/CMakeScratch/TryCompile-V1cKEE' | |
| exitCode: 0 | |
| - | |
| kind: "try_compile-v1" | |
| backtrace: | |
| - "/usr/share/cmake-3.26/Modules/Internal/CheckSourceCompiles.cmake:101 (try_compile)" | |
| - "/usr/share/cmake-3.26/Modules/Internal/CheckCompilerFlag.cmake:18 (cmake_check_source_compiles)" | |
| - "/usr/share/cmake-3.26/Modules/CheckCXXCompilerFlag.cmake:40 (cmake_check_compiler_flag)" | |
| - "cmake/AppendOptionIfAvailable.cmake:7 (check_cxx_compiler_flag)" | |
| - "cmake/ThrustBuildCompilerTargets.cmake:79 (append_option_if_available)" | |
| - "CMakeLists.txt:115 (thrust_build_compiler_targets)" | |
| checks: | |
| - "Performing Test CXX_FLAG__Wall" | |
| directories: | |
| source: "/home/ubuntu/thrust/build/CMakeFiles/CMakeScratch/TryCompile-ofc6lA" | |
| binary: "/home/ubuntu/thrust/build/CMakeFiles/CMakeScratch/TryCompile-ofc6lA" | |
| cmakeVariables: | |
| CMAKE_CXX_FLAGS: "" | |
| CMAKE_CXX_FLAGS_DEBUG: "-g" | |
| CMAKE_EXE_LINKER_FLAGS: "" | |
| buildResult: | |
| variable: "CXX_FLAG__Wall" | |
| cached: true | |
| stdout: | | |
| Change Dir: /home/ubuntu/thrust/build/CMakeFiles/CMakeScratch/TryCompile-ofc6lA | |
| Run Build Command(s):/usr/bin/cmake -E env VERBOSE=1 /usr/bin/make -f Makefile cmTC_bd408/fast && /usr/bin/make -f CMakeFiles/cmTC_bd408.dir/build.make CMakeFiles/cmTC_bd408.dir/build | |
| make[1]: Entering directory '/home/ubuntu/thrust/build/CMakeFiles/CMakeScratch/TryCompile-ofc6lA' | |
| Building CXX object CMakeFiles/cmTC_bd408.dir/src.cxx.o | |
| /usr/bin/c++ -DCXX_FLAG__Wall -Wall -o CMakeFiles/cmTC_bd408.dir/src.cxx.o -c /home/ubuntu/thrust/build/CMakeFiles/CMakeScratch/TryCompile-ofc6lA/src.cxx | |
| Linking CXX executable cmTC_bd408 | |
| /usr/bin/cmake -E cmake_link_script CMakeFiles/cmTC_bd408.dir/link.txt --verbose=1 | |
| /usr/bin/c++ CMakeFiles/cmTC_bd408.dir/src.cxx.o -o cmTC_bd408 | |
| make[1]: Leaving directory '/home/ubuntu/thrust/build/CMakeFiles/CMakeScratch/TryCompile-ofc6lA' | |
| exitCode: 0 | |
| - | |
| kind: "try_compile-v1" | |
| backtrace: | |
| - "/usr/share/cmake-3.26/Modules/Internal/CheckSourceCompiles.cmake:101 (try_compile)" | |
| - "/usr/share/cmake-3.26/Modules/Internal/CheckCompilerFlag.cmake:18 (cmake_check_source_compiles)" | |
| - "/usr/share/cmake-3.26/Modules/CheckCXXCompilerFlag.cmake:40 (cmake_check_compiler_flag)" | |
| - "cmake/AppendOptionIfAvailable.cmake:7 (check_cxx_compiler_flag)" | |
| - "cmake/ThrustBuildCompilerTargets.cmake:80 (append_option_if_available)" | |
| - "CMakeLists.txt:115 (thrust_build_compiler_targets)" | |
| checks: | |
| - "Performing Test CXX_FLAG__Wextra" | |
| directories: | |
| source: "/home/ubuntu/thrust/build/CMakeFiles/CMakeScratch/TryCompile-fMNYeE" | |
| binary: "/home/ubuntu/thrust/build/CMakeFiles/CMakeScratch/TryCompile-fMNYeE" | |
| cmakeVariables: | |
| CMAKE_CXX_FLAGS: "" | |
| CMAKE_CXX_FLAGS_DEBUG: "-g" | |
| CMAKE_EXE_LINKER_FLAGS: "" | |
| buildResult: | |
| variable: "CXX_FLAG__Wextra" | |
| cached: true | |
| stdout: | | |
| Change Dir: /home/ubuntu/thrust/build/CMakeFiles/CMakeScratch/TryCompile-fMNYeE | |
| Run Build Command(s):/usr/bin/cmake -E env VERBOSE=1 /usr/bin/make -f Makefile cmTC_ae084/fast && /usr/bin/make -f CMakeFiles/cmTC_ae084.dir/build.make CMakeFiles/cmTC_ae084.dir/build | |
| make[1]: Entering directory '/home/ubuntu/thrust/build/CMakeFiles/CMakeScratch/TryCompile-fMNYeE' | |
| Building CXX object CMakeFiles/cmTC_ae084.dir/src.cxx.o | |
| /usr/bin/c++ -DCXX_FLAG__Wextra -Wextra -o CMakeFiles/cmTC_ae084.dir/src.cxx.o -c /home/ubuntu/thrust/build/CMakeFiles/CMakeScratch/TryCompile-fMNYeE/src.cxx | |
| Linking CXX executable cmTC_ae084 | |
| /usr/bin/cmake -E cmake_link_script CMakeFiles/cmTC_ae084.dir/link.txt --verbose=1 | |
| /usr/bin/c++ CMakeFiles/cmTC_ae084.dir/src.cxx.o -o cmTC_ae084 | |
| make[1]: Leaving directory '/home/ubuntu/thrust/build/CMakeFiles/CMakeScratch/TryCompile-fMNYeE' | |
| exitCode: 0 | |
| - | |
| kind: "try_compile-v1" | |
| backtrace: | |
| - "/usr/share/cmake-3.26/Modules/Internal/CheckSourceCompiles.cmake:101 (try_compile)" | |
| - "/usr/share/cmake-3.26/Modules/Internal/CheckCompilerFlag.cmake:18 (cmake_check_source_compiles)" | |
| - "/usr/share/cmake-3.26/Modules/CheckCXXCompilerFlag.cmake:40 (cmake_check_compiler_flag)" | |
| - "cmake/AppendOptionIfAvailable.cmake:7 (check_cxx_compiler_flag)" | |
| - "cmake/ThrustBuildCompilerTargets.cmake:81 (append_option_if_available)" | |
| - "CMakeLists.txt:115 (thrust_build_compiler_targets)" | |
| checks: | |
| - "Performing Test CXX_FLAG__Winit_self" | |
| directories: | |
| source: "/home/ubuntu/thrust/build/CMakeFiles/CMakeScratch/TryCompile-0y2XqA" | |
| binary: "/home/ubuntu/thrust/build/CMakeFiles/CMakeScratch/TryCompile-0y2XqA" | |
| cmakeVariables: | |
| CMAKE_CXX_FLAGS: "" | |
| CMAKE_CXX_FLAGS_DEBUG: "-g" | |
| CMAKE_EXE_LINKER_FLAGS: "" | |
| buildResult: | |
| variable: "CXX_FLAG__Winit_self" | |
| cached: true | |
| stdout: | | |
| Change Dir: /home/ubuntu/thrust/build/CMakeFiles/CMakeScratch/TryCompile-0y2XqA | |
| Run Build Command(s):/usr/bin/cmake -E env VERBOSE=1 /usr/bin/make -f Makefile cmTC_deaf5/fast && /usr/bin/make -f CMakeFiles/cmTC_deaf5.dir/build.make CMakeFiles/cmTC_deaf5.dir/build | |
| make[1]: Entering directory '/home/ubuntu/thrust/build/CMakeFiles/CMakeScratch/TryCompile-0y2XqA' | |
| Building CXX object CMakeFiles/cmTC_deaf5.dir/src.cxx.o | |
| /usr/bin/c++ -DCXX_FLAG__Winit_self -Winit-self -o CMakeFiles/cmTC_deaf5.dir/src.cxx.o -c /home/ubuntu/thrust/build/CMakeFiles/CMakeScratch/TryCompile-0y2XqA/src.cxx | |
| Linking CXX executable cmTC_deaf5 | |
| /usr/bin/cmake -E cmake_link_script CMakeFiles/cmTC_deaf5.dir/link.txt --verbose=1 | |
| /usr/bin/c++ CMakeFiles/cmTC_deaf5.dir/src.cxx.o -o cmTC_deaf5 | |
| make[1]: Leaving directory '/home/ubuntu/thrust/build/CMakeFiles/CMakeScratch/TryCompile-0y2XqA' | |
| exitCode: 0 | |
| - | |
| kind: "try_compile-v1" | |
| backtrace: | |
| - "/usr/share/cmake-3.26/Modules/Internal/CheckSourceCompiles.cmake:101 (try_compile)" | |
| - "/usr/share/cmake-3.26/Modules/Internal/CheckCompilerFlag.cmake:18 (cmake_check_source_compiles)" | |
| - "/usr/share/cmake-3.26/Modules/CheckCXXCompilerFlag.cmake:40 (cmake_check_compiler_flag)" | |
| - "cmake/AppendOptionIfAvailable.cmake:7 (check_cxx_compiler_flag)" | |
| - "cmake/ThrustBuildCompilerTargets.cmake:82 (append_option_if_available)" | |
| - "CMakeLists.txt:115 (thrust_build_compiler_targets)" | |
| checks: | |
| - "Performing Test CXX_FLAG__Woverloaded_virtual" | |
| directories: | |
| source: "/home/ubuntu/thrust/build/CMakeFiles/CMakeScratch/TryCompile-UBwWWA" | |
| binary: "/home/ubuntu/thrust/build/CMakeFiles/CMakeScratch/TryCompile-UBwWWA" | |
| cmakeVariables: | |
| CMAKE_CXX_FLAGS: "" | |
| CMAKE_CXX_FLAGS_DEBUG: "-g" | |
| CMAKE_EXE_LINKER_FLAGS: "" | |
| buildResult: | |
| variable: "CXX_FLAG__Woverloaded_virtual" | |
| cached: true | |
| stdout: | | |
| Change Dir: /home/ubuntu/thrust/build/CMakeFiles/CMakeScratch/TryCompile-UBwWWA | |
| Run Build Command(s):/usr/bin/cmake -E env VERBOSE=1 /usr/bin/make -f Makefile cmTC_c53d4/fast && /usr/bin/make -f CMakeFiles/cmTC_c53d4.dir/build.make CMakeFiles/cmTC_c53d4.dir/build | |
| make[1]: Entering directory '/home/ubuntu/thrust/build/CMakeFiles/CMakeScratch/TryCompile-UBwWWA' | |
| Building CXX object CMakeFiles/cmTC_c53d4.dir/src.cxx.o | |
| /usr/bin/c++ -DCXX_FLAG__Woverloaded_virtual -Woverloaded-virtual -o CMakeFiles/cmTC_c53d4.dir/src.cxx.o -c /home/ubuntu/thrust/build/CMakeFiles/CMakeScratch/TryCompile-UBwWWA/src.cxx | |
| Linking CXX executable cmTC_c53d4 | |
| /usr/bin/cmake -E cmake_link_script CMakeFiles/cmTC_c53d4.dir/link.txt --verbose=1 | |
| /usr/bin/c++ CMakeFiles/cmTC_c53d4.dir/src.cxx.o -o cmTC_c53d4 | |
| make[1]: Leaving directory '/home/ubuntu/thrust/build/CMakeFiles/CMakeScratch/TryCompile-UBwWWA' | |
| exitCode: 0 | |
| - | |
| kind: "try_compile-v1" | |
| backtrace: | |
| - "/usr/share/cmake-3.26/Modules/Internal/CheckSourceCompiles.cmake:101 (try_compile)" | |
| - "/usr/share/cmake-3.26/Modules/Internal/CheckCompilerFlag.cmake:18 (cmake_check_source_compiles)" | |
| - "/usr/share/cmake-3.26/Modules/CheckCXXCompilerFlag.cmake:40 (cmake_check_compiler_flag)" | |
| - "cmake/AppendOptionIfAvailable.cmake:7 (check_cxx_compiler_flag)" | |
| - "cmake/ThrustBuildCompilerTargets.cmake:83 (append_option_if_available)" | |
| - "CMakeLists.txt:115 (thrust_build_compiler_targets)" | |
| checks: | |
| - "Performing Test CXX_FLAG__Wcast_qual" | |
| directories: | |
| source: "/home/ubuntu/thrust/build/CMakeFiles/CMakeScratch/TryCompile-93hVJB" | |
| binary: "/home/ubuntu/thrust/build/CMakeFiles/CMakeScratch/TryCompile-93hVJB" | |
| cmakeVariables: | |
| CMAKE_CXX_FLAGS: "" | |
| CMAKE_CXX_FLAGS_DEBUG: "-g" | |
| CMAKE_EXE_LINKER_FLAGS: "" | |
| buildResult: | |
| variable: "CXX_FLAG__Wcast_qual" | |
| cached: true | |
| stdout: | | |
| Change Dir: /home/ubuntu/thrust/build/CMakeFiles/CMakeScratch/TryCompile-93hVJB | |
| Run Build Command(s):/usr/bin/cmake -E env VERBOSE=1 /usr/bin/make -f Makefile cmTC_72dfd/fast && /usr/bin/make -f CMakeFiles/cmTC_72dfd.dir/build.make CMakeFiles/cmTC_72dfd.dir/build | |
| make[1]: Entering directory '/home/ubuntu/thrust/build/CMakeFiles/CMakeScratch/TryCompile-93hVJB' | |
| Building CXX object CMakeFiles/cmTC_72dfd.dir/src.cxx.o | |
| /usr/bin/c++ -DCXX_FLAG__Wcast_qual -Wcast-qual -o CMakeFiles/cmTC_72dfd.dir/src.cxx.o -c /home/ubuntu/thrust/build/CMakeFiles/CMakeScratch/TryCompile-93hVJB/src.cxx | |
| Linking CXX executable cmTC_72dfd | |
| /usr/bin/cmake -E cmake_link_script CMakeFiles/cmTC_72dfd.dir/link.txt --verbose=1 | |
| /usr/bin/c++ CMakeFiles/cmTC_72dfd.dir/src.cxx.o -o cmTC_72dfd | |
| make[1]: Leaving directory '/home/ubuntu/thrust/build/CMakeFiles/CMakeScratch/TryCompile-93hVJB' | |
| exitCode: 0 | |
| - | |
| kind: "try_compile-v1" | |
| backtrace: | |
| - "/usr/share/cmake-3.26/Modules/Internal/CheckSourceCompiles.cmake:101 (try_compile)" | |
| - "/usr/share/cmake-3.26/Modules/Internal/CheckCompilerFlag.cmake:18 (cmake_check_source_compiles)" | |
| - "/usr/share/cmake-3.26/Modules/CheckCXXCompilerFlag.cmake:40 (cmake_check_compiler_flag)" | |
| - "cmake/AppendOptionIfAvailable.cmake:7 (check_cxx_compiler_flag)" | |
| - "cmake/ThrustBuildCompilerTargets.cmake:84 (append_option_if_available)" | |
| - "CMakeLists.txt:115 (thrust_build_compiler_targets)" | |
| checks: | |
| - "Performing Test CXX_FLAG__Wpointer_arith" | |
| directories: | |
| source: "/home/ubuntu/thrust/build/CMakeFiles/CMakeScratch/TryCompile-YenkAA" | |
| binary: "/home/ubuntu/thrust/build/CMakeFiles/CMakeScratch/TryCompile-YenkAA" | |
| cmakeVariables: | |
| CMAKE_CXX_FLAGS: "" | |
| CMAKE_CXX_FLAGS_DEBUG: "-g" | |
| CMAKE_EXE_LINKER_FLAGS: "" | |
| buildResult: | |
| variable: "CXX_FLAG__Wpointer_arith" | |
| cached: true | |
| stdout: | | |
| Change Dir: /home/ubuntu/thrust/build/CMakeFiles/CMakeScratch/TryCompile-YenkAA | |
| Run Build Command(s):/usr/bin/cmake -E env VERBOSE=1 /usr/bin/make -f Makefile cmTC_92128/fast && /usr/bin/make -f CMakeFiles/cmTC_92128.dir/build.make CMakeFiles/cmTC_92128.dir/build | |
| make[1]: Entering directory '/home/ubuntu/thrust/build/CMakeFiles/CMakeScratch/TryCompile-YenkAA' | |
| Building CXX object CMakeFiles/cmTC_92128.dir/src.cxx.o | |
| /usr/bin/c++ -DCXX_FLAG__Wpointer_arith -Wpointer-arith -o CMakeFiles/cmTC_92128.dir/src.cxx.o -c /home/ubuntu/thrust/build/CMakeFiles/CMakeScratch/TryCompile-YenkAA/src.cxx | |
| Linking CXX executable cmTC_92128 | |
| /usr/bin/cmake -E cmake_link_script CMakeFiles/cmTC_92128.dir/link.txt --verbose=1 | |
| /usr/bin/c++ CMakeFiles/cmTC_92128.dir/src.cxx.o -o cmTC_92128 | |
| make[1]: Leaving directory '/home/ubuntu/thrust/build/CMakeFiles/CMakeScratch/TryCompile-YenkAA' | |
| exitCode: 0 | |
| - | |
| kind: "try_compile-v1" | |
| backtrace: | |
| - "/usr/share/cmake-3.26/Modules/Internal/CheckSourceCompiles.cmake:101 (try_compile)" | |
| - "/usr/share/cmake-3.26/Modules/Internal/CheckCompilerFlag.cmake:18 (cmake_check_source_compiles)" | |
| - "/usr/share/cmake-3.26/Modules/CheckCXXCompilerFlag.cmake:40 (cmake_check_compiler_flag)" | |
| - "cmake/AppendOptionIfAvailable.cmake:7 (check_cxx_compiler_flag)" | |
| - "cmake/ThrustBuildCompilerTargets.cmake:85 (append_option_if_available)" | |
| - "CMakeLists.txt:115 (thrust_build_compiler_targets)" | |
| checks: | |
| - "Performing Test CXX_FLAG__Wunused_local_typedef" | |
| directories: | |
| source: "/home/ubuntu/thrust/build/CMakeFiles/CMakeScratch/TryCompile-9FXPEC" | |
| binary: "/home/ubuntu/thrust/build/CMakeFiles/CMakeScratch/TryCompile-9FXPEC" | |
| cmakeVariables: | |
| CMAKE_CXX_FLAGS: "" | |
| CMAKE_CXX_FLAGS_DEBUG: "-g" | |
| CMAKE_EXE_LINKER_FLAGS: "" | |
| buildResult: | |
| variable: "CXX_FLAG__Wunused_local_typedef" | |
| cached: true | |
| stdout: | | |
| Change Dir: /home/ubuntu/thrust/build/CMakeFiles/CMakeScratch/TryCompile-9FXPEC | |
| Run Build Command(s):/usr/bin/cmake -E env VERBOSE=1 /usr/bin/make -f Makefile cmTC_57717/fast && /usr/bin/make -f CMakeFiles/cmTC_57717.dir/build.make CMakeFiles/cmTC_57717.dir/build | |
| make[1]: Entering directory '/home/ubuntu/thrust/build/CMakeFiles/CMakeScratch/TryCompile-9FXPEC' | |
| Building CXX object CMakeFiles/cmTC_57717.dir/src.cxx.o | |
| /usr/bin/c++ -DCXX_FLAG__Wunused_local_typedef -Wunused-local-typedef -o CMakeFiles/cmTC_57717.dir/src.cxx.o -c /home/ubuntu/thrust/build/CMakeFiles/CMakeScratch/TryCompile-9FXPEC/src.cxx | |
| c++: error: unrecognized command line option '-Wunused-local-typedef'; did you mean '-Wunused-local-typedefs'? | |
| make[1]: *** [CMakeFiles/cmTC_57717.dir/build.make:78: CMakeFiles/cmTC_57717.dir/src.cxx.o] Error 1 | |
| make[1]: Leaving directory '/home/ubuntu/thrust/build/CMakeFiles/CMakeScratch/TryCompile-9FXPEC' | |
| make: *** [Makefile:127: cmTC_57717/fast] Error 2 | |
| exitCode: 2 | |
| - | |
| kind: "try_compile-v1" | |
| backtrace: | |
| - "/usr/share/cmake-3.26/Modules/Internal/CheckSourceCompiles.cmake:101 (try_compile)" | |
| - "/usr/share/cmake-3.26/Modules/Internal/CheckCompilerFlag.cmake:18 (cmake_check_source_compiles)" | |
| - "/usr/share/cmake-3.26/Modules/CheckCXXCompilerFlag.cmake:40 (cmake_check_compiler_flag)" | |
| - "cmake/AppendOptionIfAvailable.cmake:7 (check_cxx_compiler_flag)" | |
| - "cmake/ThrustBuildCompilerTargets.cmake:86 (append_option_if_available)" | |
| - "CMakeLists.txt:115 (thrust_build_compiler_targets)" | |
| checks: | |
| - "Performing Test CXX_FLAG__Wvla" | |
| directories: | |
| source: "/home/ubuntu/thrust/build/CMakeFiles/CMakeScratch/TryCompile-nL18gC" | |
| binary: "/home/ubuntu/thrust/build/CMakeFiles/CMakeScratch/TryCompile-nL18gC" | |
| cmakeVariables: | |
| CMAKE_CXX_FLAGS: "" | |
| CMAKE_CXX_FLAGS_DEBUG: "-g" | |
| CMAKE_EXE_LINKER_FLAGS: "" | |
| buildResult: | |
| variable: "CXX_FLAG__Wvla" | |
| cached: true | |
| stdout: | | |
| Change Dir: /home/ubuntu/thrust/build/CMakeFiles/CMakeScratch/TryCompile-nL18gC | |
| Run Build Command(s):/usr/bin/cmake -E env VERBOSE=1 /usr/bin/make -f Makefile cmTC_49f40/fast && /usr/bin/make -f CMakeFiles/cmTC_49f40.dir/build.make CMakeFiles/cmTC_49f40.dir/build | |
| make[1]: Entering directory '/home/ubuntu/thrust/build/CMakeFiles/CMakeScratch/TryCompile-nL18gC' | |
| Building CXX object CMakeFiles/cmTC_49f40.dir/src.cxx.o | |
| /usr/bin/c++ -DCXX_FLAG__Wvla -Wvla -o CMakeFiles/cmTC_49f40.dir/src.cxx.o -c /home/ubuntu/thrust/build/CMakeFiles/CMakeScratch/TryCompile-nL18gC/src.cxx | |
| Linking CXX executable cmTC_49f40 | |
| /usr/bin/cmake -E cmake_link_script CMakeFiles/cmTC_49f40.dir/link.txt --verbose=1 | |
| /usr/bin/c++ CMakeFiles/cmTC_49f40.dir/src.cxx.o -o cmTC_49f40 | |
| make[1]: Leaving directory '/home/ubuntu/thrust/build/CMakeFiles/CMakeScratch/TryCompile-nL18gC' | |
| exitCode: 0 | |
| - | |
| kind: "try_compile-v1" | |
| backtrace: | |
| - "/usr/share/cmake-3.26/Modules/Internal/CheckSourceCompiles.cmake:101 (try_compile)" | |
| - "/usr/share/cmake-3.26/Modules/Internal/CheckCompilerFlag.cmake:18 (cmake_check_source_compiles)" | |
| - "/usr/share/cmake-3.26/Modules/CheckCXXCompilerFlag.cmake:40 (cmake_check_compiler_flag)" | |
| - "cmake/AppendOptionIfAvailable.cmake:7 (check_cxx_compiler_flag)" | |
| - "cmake/ThrustBuildCompilerTargets.cmake:89 (append_option_if_available)" | |
| - "CMakeLists.txt:115 (thrust_build_compiler_targets)" | |
| checks: | |
| - "Performing Test CXX_FLAG__Wgnu" | |
| directories: | |
| source: "/home/ubuntu/thrust/build/CMakeFiles/CMakeScratch/TryCompile-JpK7YB" | |
| binary: "/home/ubuntu/thrust/build/CMakeFiles/CMakeScratch/TryCompile-JpK7YB" | |
| cmakeVariables: | |
| CMAKE_CXX_FLAGS: "" | |
| CMAKE_CXX_FLAGS_DEBUG: "-g" | |
| CMAKE_EXE_LINKER_FLAGS: "" | |
| buildResult: | |
| variable: "CXX_FLAG__Wgnu" | |
| cached: true | |
| stdout: | | |
| Change Dir: /home/ubuntu/thrust/build/CMakeFiles/CMakeScratch/TryCompile-JpK7YB | |
| Run Build Command(s):/usr/bin/cmake -E env VERBOSE=1 /usr/bin/make -f Makefile cmTC_8ed8c/fast && /usr/bin/make -f CMakeFiles/cmTC_8ed8c.dir/build.make CMakeFiles/cmTC_8ed8c.dir/build | |
| make[1]: Entering directory '/home/ubuntu/thrust/build/CMakeFiles/CMakeScratch/TryCompile-JpK7YB' | |
| Building CXX object CMakeFiles/cmTC_8ed8c.dir/src.cxx.o | |
| /usr/bin/c++ -DCXX_FLAG__Wgnu -Wgnu -o CMakeFiles/cmTC_8ed8c.dir/src.cxx.o -c /home/ubuntu/thrust/build/CMakeFiles/CMakeScratch/TryCompile-JpK7YB/src.cxx | |
| c++: error: unrecognized command line option '-Wgnu' | |
| make[1]: *** [CMakeFiles/cmTC_8ed8c.dir/build.make:78: CMakeFiles/cmTC_8ed8c.dir/src.cxx.o] Error 1 | |
| make[1]: Leaving directory '/home/ubuntu/thrust/build/CMakeFiles/CMakeScratch/TryCompile-JpK7YB' | |
| make: *** [Makefile:127: cmTC_8ed8c/fast] Error 2 | |
| exitCode: 2 | |
| - | |
| kind: "try_compile-v1" | |
| backtrace: | |
| - "/usr/share/cmake-3.26/Modules/Internal/CheckSourceCompiles.cmake:101 (try_compile)" | |
| - "/usr/share/cmake-3.26/Modules/Internal/CheckCompilerFlag.cmake:18 (cmake_check_source_compiles)" | |
| - "/usr/share/cmake-3.26/Modules/CheckCXXCompilerFlag.cmake:40 (cmake_check_compiler_flag)" | |
| - "cmake/AppendOptionIfAvailable.cmake:7 (check_cxx_compiler_flag)" | |
| - "cmake/ThrustBuildCompilerTargets.cmake:93 (append_option_if_available)" | |
| - "CMakeLists.txt:115 (thrust_build_compiler_targets)" | |
| checks: | |
| - "Performing Test CXX_FLAG__Wno_gnu_zero_variadic_macro_arguments" | |
| directories: | |
| source: "/home/ubuntu/thrust/build/CMakeFiles/CMakeScratch/TryCompile-V5QLMC" | |
| binary: "/home/ubuntu/thrust/build/CMakeFiles/CMakeScratch/TryCompile-V5QLMC" | |
| cmakeVariables: | |
| CMAKE_CXX_FLAGS: "" | |
| CMAKE_CXX_FLAGS_DEBUG: "-g" | |
| CMAKE_EXE_LINKER_FLAGS: "" | |
| buildResult: | |
| variable: "CXX_FLAG__Wno_gnu_zero_variadic_macro_arguments" | |
| cached: true | |
| stdout: | | |
| Change Dir: /home/ubuntu/thrust/build/CMakeFiles/CMakeScratch/TryCompile-V5QLMC | |
| Run Build Command(s):/usr/bin/cmake -E env VERBOSE=1 /usr/bin/make -f Makefile cmTC_1a2b8/fast && /usr/bin/make -f CMakeFiles/cmTC_1a2b8.dir/build.make CMakeFiles/cmTC_1a2b8.dir/build | |
| make[1]: Entering directory '/home/ubuntu/thrust/build/CMakeFiles/CMakeScratch/TryCompile-V5QLMC' | |
| Building CXX object CMakeFiles/cmTC_1a2b8.dir/src.cxx.o | |
| /usr/bin/c++ -DCXX_FLAG__Wno_gnu_zero_variadic_macro_arguments -Wno-gnu-zero-variadic-macro-arguments -o CMakeFiles/cmTC_1a2b8.dir/src.cxx.o -c /home/ubuntu/thrust/build/CMakeFiles/CMakeScratch/TryCompile-V5QLMC/src.cxx | |
| Linking CXX executable cmTC_1a2b8 | |
| /usr/bin/cmake -E cmake_link_script CMakeFiles/cmTC_1a2b8.dir/link.txt --verbose=1 | |
| /usr/bin/c++ CMakeFiles/cmTC_1a2b8.dir/src.cxx.o -o cmTC_1a2b8 | |
| make[1]: Leaving directory '/home/ubuntu/thrust/build/CMakeFiles/CMakeScratch/TryCompile-V5QLMC' | |
| exitCode: 0 | |
| - | |
| kind: "try_compile-v1" | |
| backtrace: | |
| - "/usr/share/cmake-3.26/Modules/Internal/CheckSourceCompiles.cmake:101 (try_compile)" | |
| - "/usr/share/cmake-3.26/Modules/Internal/CheckCompilerFlag.cmake:18 (cmake_check_source_compiles)" | |
| - "/usr/share/cmake-3.26/Modules/CheckCXXCompilerFlag.cmake:40 (cmake_check_compiler_flag)" | |
| - "cmake/AppendOptionIfAvailable.cmake:7 (check_cxx_compiler_flag)" | |
| - "cmake/ThrustBuildCompilerTargets.cmake:96 (append_option_if_available)" | |
| - "CMakeLists.txt:115 (thrust_build_compiler_targets)" | |
| checks: | |
| - "Performing Test CXX_FLAG__Wno_unused_function" | |
| directories: | |
| source: "/home/ubuntu/thrust/build/CMakeFiles/CMakeScratch/TryCompile-0XPtJE" | |
| binary: "/home/ubuntu/thrust/build/CMakeFiles/CMakeScratch/TryCompile-0XPtJE" | |
| cmakeVariables: | |
| CMAKE_CXX_FLAGS: "" | |
| CMAKE_CXX_FLAGS_DEBUG: "-g" | |
| CMAKE_EXE_LINKER_FLAGS: "" | |
| buildResult: | |
| variable: "CXX_FLAG__Wno_unused_function" | |
| cached: true | |
| stdout: | | |
| Change Dir: /home/ubuntu/thrust/build/CMakeFiles/CMakeScratch/TryCompile-0XPtJE | |
| Run Build Command(s):/usr/bin/cmake -E env VERBOSE=1 /usr/bin/make -f Makefile cmTC_88fbf/fast && /usr/bin/make -f CMakeFiles/cmTC_88fbf.dir/build.make CMakeFiles/cmTC_88fbf.dir/build | |
| make[1]: Entering directory '/home/ubuntu/thrust/build/CMakeFiles/CMakeScratch/TryCompile-0XPtJE' | |
| Building CXX object CMakeFiles/cmTC_88fbf.dir/src.cxx.o | |
| /usr/bin/c++ -DCXX_FLAG__Wno_unused_function -Wno-unused-function -o CMakeFiles/cmTC_88fbf.dir/src.cxx.o -c /home/ubuntu/thrust/build/CMakeFiles/CMakeScratch/TryCompile-0XPtJE/src.cxx | |
| Linking CXX executable cmTC_88fbf | |
| /usr/bin/cmake -E cmake_link_script CMakeFiles/cmTC_88fbf.dir/link.txt --verbose=1 | |
| /usr/bin/c++ CMakeFiles/cmTC_88fbf.dir/src.cxx.o -o cmTC_88fbf | |
| make[1]: Leaving directory '/home/ubuntu/thrust/build/CMakeFiles/CMakeScratch/TryCompile-0XPtJE' | |
| exitCode: 0 | |
| - | |
| kind: "try_compile-v1" | |
| backtrace: | |
| - "/usr/share/cmake-3.26/Modules/Internal/CheckSourceCompiles.cmake:101 (try_compile)" | |
| - "/usr/share/cmake-3.26/Modules/Internal/CheckCompilerFlag.cmake:18 (cmake_check_source_compiles)" | |
| - "/usr/share/cmake-3.26/Modules/CheckCXXCompilerFlag.cmake:40 (cmake_check_compiler_flag)" | |
| - "cmake/AppendOptionIfAvailable.cmake:7 (check_cxx_compiler_flag)" | |
| - "cmake/ThrustBuildCompilerTargets.cmake:103 (append_option_if_available)" | |
| - "CMakeLists.txt:115 (thrust_build_compiler_targets)" | |
| checks: | |
| - "Performing Test CXX_FLAG__Wno_noexcept_type" | |
| directories: | |
| source: "/home/ubuntu/thrust/build/CMakeFiles/CMakeScratch/TryCompile-QHo2aD" | |
| binary: "/home/ubuntu/thrust/build/CMakeFiles/CMakeScratch/TryCompile-QHo2aD" | |
| cmakeVariables: | |
| CMAKE_CXX_FLAGS: "" | |
| CMAKE_CXX_FLAGS_DEBUG: "-g" | |
| CMAKE_EXE_LINKER_FLAGS: "" | |
| buildResult: | |
| variable: "CXX_FLAG__Wno_noexcept_type" | |
| cached: true | |
| stdout: | | |
| Change Dir: /home/ubuntu/thrust/build/CMakeFiles/CMakeScratch/TryCompile-QHo2aD | |
| Run Build Command(s):/usr/bin/cmake -E env VERBOSE=1 /usr/bin/make -f Makefile cmTC_3d4f0/fast && /usr/bin/make -f CMakeFiles/cmTC_3d4f0.dir/build.make CMakeFiles/cmTC_3d4f0.dir/build | |
| make[1]: Entering directory '/home/ubuntu/thrust/build/CMakeFiles/CMakeScratch/TryCompile-QHo2aD' | |
| Building CXX object CMakeFiles/cmTC_3d4f0.dir/src.cxx.o | |
| /usr/bin/c++ -DCXX_FLAG__Wno_noexcept_type -Wno-noexcept-type -o CMakeFiles/cmTC_3d4f0.dir/src.cxx.o -c /home/ubuntu/thrust/build/CMakeFiles/CMakeScratch/TryCompile-QHo2aD/src.cxx | |
| Linking CXX executable cmTC_3d4f0 | |
| /usr/bin/cmake -E cmake_link_script CMakeFiles/cmTC_3d4f0.dir/link.txt --verbose=1 | |
| /usr/bin/c++ CMakeFiles/cmTC_3d4f0.dir/src.cxx.o -o cmTC_3d4f0 | |
| make[1]: Leaving directory '/home/ubuntu/thrust/build/CMakeFiles/CMakeScratch/TryCompile-QHo2aD' | |
| exitCode: 0 | |
| - | |
| kind: "message-v1" | |
| backtrace: | |
| - "/usr/share/cmake-3.26/Modules/CMakeDetermineCompilerId.cmake:1102 (message)" | |
| - "/usr/share/cmake-3.26/Modules/CMakeDetermineCUDACompiler.cmake:75 (CMAKE_DETERMINE_COMPILER_ID_VENDOR)" | |
| - "cmake/ThrustCudaConfig.cmake:1 (enable_language)" | |
| - "CMakeLists.txt:118 (include)" | |
| message: | | |
| Checking whether the CUDA compiler is NVIDIA using "" matched "nvcc: NVIDIA \\(R\\) Cuda compiler driver": | |
| nvcc: NVIDIA (R) Cuda compiler driver | |
| Copyright (c) 2005-2022 NVIDIA Corporation | |
| Built on Wed_Sep_21_10:33:58_PDT_2022 | |
| Cuda compilation tools, release 11.8, V11.8.89 | |
| Build cuda_11.8.r11.8/compiler.31833905_0 | |
| - | |
| kind: "message-v1" | |
| backtrace: | |
| - "/usr/share/cmake-3.26/Modules/CMakeDetermineCompilerId.cmake:17 (message)" | |
| - "/usr/share/cmake-3.26/Modules/CMakeDetermineCompilerId.cmake:53 (__determine_compiler_id_test)" | |
| - "/usr/share/cmake-3.26/Modules/CMakeDetermineCUDACompiler.cmake:307 (CMAKE_DETERMINE_COMPILER_ID)" | |
| - "cmake/ThrustCudaConfig.cmake:1 (enable_language)" | |
| - "CMakeLists.txt:118 (include)" | |
| message: | | |
| Compiling the CUDA compiler identification source file "CMakeCUDACompilerId.cu" succeeded. | |
| Compiler: /usr/bin/nvcc | |
| Build flags: | |
| Id flags: --keep;--keep-dir;tmp;-ccbin=/usr/bin/c++ -v | |
| The output was: | |
| 0 | |
| #$ _NVVM_BRANCH_=nvvm | |
| #$ _SPACE_= | |
| #$ _CUDART_=cudart | |
| #$ _HERE_=/usr/lib/nvidia-cuda-toolkit/bin | |
| #$ _THERE_=/usr/lib/nvidia-cuda-toolkit/bin | |
| #$ _TARGET_SIZE_= | |
| #$ _TARGET_DIR_= | |
| #$ _TARGET_SIZE_=64 | |
| #$ NVVMIR_LIBRARY_DIR=/usr/lib/nvidia-cuda-toolkit/libdevice | |
| #$ PATH=/usr/lib/nvidia-cuda-toolkit/bin:/home/ubuntu/.local/bin:/home/ubuntu/.local/bin:/usr/local/sbin:/usr/local/bin:/usr/sbin:/usr/bin:/sbin:/bin:/usr/games:/usr/local/games:/snap/bin | |
| #$ LIBRARIES= -L/usr/lib/x86_64-linux-gnu/stubs -L/usr/lib/x86_64-linux-gnu | |
| #$ rm tmp/a_dlink.reg.c | |
| #$ "/usr/bin"/c++ -D__CUDA_ARCH__=520 -D__CUDA_ARCH_LIST__=520 -E -x c++ -DCUDA_DOUBLE_MATH_FUNCTIONS -D__CUDACC__ -D__NVCC__ -D__CUDACC_VER_MAJOR__=11 -D__CUDACC_VER_MINOR__=8 -D__CUDACC_VER_BUILD__=89 -D__CUDA_API_VER_MAJOR__=11 -D__CUDA_API_VER_MINOR__=8 -D__NVCC_DIAG_PRAGMA_SUPPORT__=1 -include "cuda_runtime.h" -m64 "CMakeCUDACompilerId.cu" -o "tmp/CMakeCUDACompilerId.cpp1.ii" | |
| #$ cicc --c++14 --gnu_version=90400 --display_error_number --orig_src_file_name "CMakeCUDACompilerId.cu" --orig_src_path_name "/home/ubuntu/thrust/build/CMakeFiles/3.26.4/CompilerIdCUDA/CMakeCUDACompilerId.cu" --allow_managed -arch compute_52 -m64 --no-version-ident -ftz=0 -prec_div=1 -prec_sqrt=1 -fmad=1 --include_file_name "CMakeCUDACompilerId.fatbin.c" -tused --gen_module_id_file --module_id_file_name "tmp/CMakeCUDACompilerId.module_id" --gen_c_file_name "tmp/CMakeCUDACompilerId.cudafe1.c" --stub_file_name "tmp/CMakeCUDACompilerId.cudafe1.stub.c" --gen_device_file_name "tmp/CMakeCUDACompilerId.cudafe1.gpu" "tmp/CMakeCUDACompilerId.cpp1.ii" -o "tmp/CMakeCUDACompilerId.ptx" | |
| #$ ptxas -arch=sm_52 -m64 "tmp/CMakeCUDACompilerId.ptx" -o "tmp/CMakeCUDACompilerId.sm_52.cubin" | |
| #$ fatbinary --create="tmp/CMakeCUDACompilerId.fatbin" -64 --cicc-cmdline="-ftz=0 -prec_div=1 -prec_sqrt=1 -fmad=1 " "--image3=kind=elf,sm=52,file=tmp/CMakeCUDACompilerId.sm_52.cubin" "--image3=kind=ptx,sm=52,file=tmp/CMakeCUDACompilerId.ptx" --embedded-fatbin="tmp/CMakeCUDACompilerId.fatbin.c" | |
| #$ "/usr/bin"/c++ -D__CUDA_ARCH_LIST__=520 -E -x c++ -D__CUDACC__ -D__NVCC__ -D__CUDACC_VER_MAJOR__=11 -D__CUDACC_VER_MINOR__=8 -D__CUDACC_VER_BUILD__=89 -D__CUDA_API_VER_MAJOR__=11 -D__CUDA_API_VER_MINOR__=8 -D__NVCC_DIAG_PRAGMA_SUPPORT__=1 -include "cuda_runtime.h" -m64 "CMakeCUDACompilerId.cu" -o "tmp/CMakeCUDACompilerId.cpp4.ii" | |
| #$ cudafe++ --c++14 --gnu_version=90400 --display_error_number --orig_src_file_name "CMakeCUDACompilerId.cu" --orig_src_path_name "/home/ubuntu/thrust/build/CMakeFiles/3.26.4/CompilerIdCUDA/CMakeCUDACompilerId.cu" --allow_managed --m64 --parse_templates --gen_c_file_name "tmp/CMakeCUDACompilerId.cudafe1.cpp" --stub_file_name "CMakeCUDACompilerId.cudafe1.stub.c" --module_id_file_name "tmp/CMakeCUDACompilerId.module_id" "tmp/CMakeCUDACompilerId.cpp4.ii" | |
| #$ "/usr/bin"/c++ -D__CUDA_ARCH__=520 -D__CUDA_ARCH_LIST__=520 -c -x c++ -DCUDA_DOUBLE_MATH_FUNCTIONS -m64 "tmp/CMakeCUDACompilerId.cudafe1.cpp" -o "tmp/CMakeCUDACompilerId.o" | |
| #$ nvlink -m64 --arch=sm_52 --register-link-binaries="tmp/a_dlink.reg.c" -L/usr/lib/x86_64-linux-gnu/stubs -L/usr/lib/x86_64-linux-gnu -cpu-arch=X86_64 "tmp/CMakeCUDACompilerId.o" -lcudadevrt -o "tmp/a_dlink.sm_52.cubin" --host-ccbin "/usr/bin/c++" | |
| #$ fatbinary --create="tmp/a_dlink.fatbin" -64 --cicc-cmdline="-ftz=0 -prec_div=1 -prec_sqrt=1 -fmad=1 " -link "--image3=kind=elf,sm=52,file=tmp/a_dlink.sm_52.cubin" --embedded-fatbin="tmp/a_dlink.fatbin.c" | |
| #$ "/usr/bin"/c++ -D__CUDA_ARCH_LIST__=520 -c -x c++ -DFATBINFILE="\\"tmp/a_dlink.fatbin.c\\"" -DREGISTERLINKBINARYFILE="\\"tmp/a_dlink.reg.c\\"" -I. -D__NV_EXTRA_INITIALIZATION= -D__NV_EXTRA_FINALIZATION= -D__CUDA_INCLUDE_COMPILER_INTERNAL_HEADERS__ -D__CUDACC_VER_MAJOR__=11 -D__CUDACC_VER_MINOR__=8 -D__CUDACC_VER_BUILD__=89 -D__CUDA_API_VER_MAJOR__=11 -D__CUDA_API_VER_MINOR__=8 -D__NVCC_DIAG_PRAGMA_SUPPORT__=1 -m64 "/usr/lib/nvidia-cuda-toolkit/bin/crt/link.stub" -o "tmp/a_dlink.o" | |
| #$ "/usr/bin"/c++ -D__CUDA_ARCH_LIST__=520 -m64 -Wl,--start-group "tmp/a_dlink.o" "tmp/CMakeCUDACompilerId.o" -L/usr/lib/x86_64-linux-gnu/stubs -L/usr/lib/x86_64-linux-gnu -lcudadevrt -lcudart_static -lrt -lpthread -ldl -Wl,--end-group -o "a.out" | |
| Compilation of the CUDA compiler identification source "CMakeCUDACompilerId.cu" produced "a.out" | |
| The CUDA compiler identification is NVIDIA, found in: | |
| /home/ubuntu/thrust/build/CMakeFiles/3.26.4/CompilerIdCUDA/a.out | |
| - | |
| kind: "message-v1" | |
| backtrace: | |
| - "/usr/share/cmake-3.26/Modules/CMakeDetermineCUDACompiler.cmake:523 (message)" | |
| - "cmake/ThrustCudaConfig.cmake:1 (enable_language)" | |
| - "CMakeLists.txt:118 (include)" | |
| message: | | |
| Parsed CUDA nvcc implicit link information: | |
| found 'PATH=' string: [/usr/lib/nvidia-cuda-toolkit/bin:/home/ubuntu/.local/bin:/home/ubuntu/.local/bin:/usr/local/sbin:/usr/local/bin:/usr/sbin:/usr/bin:/sbin:/bin:/usr/games:/usr/local/games:/snap/bin] | |
| found 'LIBRARIES=' string: [-L/usr/lib/x86_64-linux-gnu/stubs -L/usr/lib/x86_64-linux-gnu] | |
| considering line: [#$ rm tmp/a_dlink.reg.c] | |
| considering line: ["/usr/bin"/c++ -D__CUDA_ARCH__=520 -D__CUDA_ARCH_LIST__=520 -E -x c++ -DCUDA_DOUBLE_MATH_FUNCTIONS -D__CUDACC__ -D__NVCC__ -D__CUDACC_VER_MAJOR__=11 -D__CUDACC_VER_MINOR__=8 -D__CUDACC_VER_BUILD__=89 -D__CUDA_API_VER_MAJOR__=11 -D__CUDA_API_VER_MINOR__=8 -D__NVCC_DIAG_PRAGMA_SUPPORT__=1 -include "cuda_runtime.h" -m64 "CMakeCUDACompilerId.cu" -o "tmp/CMakeCUDACompilerId.cpp1.ii" ] | |
| considering line: [cicc --c++14 --gnu_version=90400 --display_error_number --orig_src_file_name "CMakeCUDACompilerId.cu" --orig_src_path_name "/home/ubuntu/thrust/build/CMakeFiles/3.26.4/CompilerIdCUDA/CMakeCUDACompilerId.cu" --allow_managed -arch compute_52 -m64 --no-version-ident -ftz=0 -prec_div=1 -prec_sqrt=1 -fmad=1 --include_file_name "CMakeCUDACompilerId.fatbin.c" -tused --gen_module_id_file --module_id_file_name "tmp/CMakeCUDACompilerId.module_id" --gen_c_file_name "tmp/CMakeCUDACompilerId.cudafe1.c" --stub_file_name "tmp/CMakeCUDACompilerId.cudafe1.stub.c" --gen_device_file_name "tmp/CMakeCUDACompilerId.cudafe1.gpu" "tmp/CMakeCUDACompilerId.cpp1.ii" -o "tmp/CMakeCUDACompilerId.ptx"] | |
| considering line: [ptxas -arch=sm_52 -m64 "tmp/CMakeCUDACompilerId.ptx" -o "tmp/CMakeCUDACompilerId.sm_52.cubin" ] | |
| considering line: [fatbinary --create="tmp/CMakeCUDACompilerId.fatbin" -64 --cicc-cmdline="-ftz=0 -prec_div=1 -prec_sqrt=1 -fmad=1 " "--image3=kind=elf,sm=52,file=tmp/CMakeCUDACompilerId.sm_52.cubin" "--image3=kind=ptx,sm=52,file=tmp/CMakeCUDACompilerId.ptx" --embedded-fatbin="tmp/CMakeCUDACompilerId.fatbin.c" ] | |
| considering line: ["/usr/bin"/c++ -D__CUDA_ARCH_LIST__=520 -E -x c++ -D__CUDACC__ -D__NVCC__ -D__CUDACC_VER_MAJOR__=11 -D__CUDACC_VER_MINOR__=8 -D__CUDACC_VER_BUILD__=89 -D__CUDA_API_VER_MAJOR__=11 -D__CUDA_API_VER_MINOR__=8 -D__NVCC_DIAG_PRAGMA_SUPPORT__=1 -include "cuda_runtime.h" -m64 "CMakeCUDACompilerId.cu" -o "tmp/CMakeCUDACompilerId.cpp4.ii" ] | |
| considering line: [cudafe++ --c++14 --gnu_version=90400 --display_error_number --orig_src_file_name "CMakeCUDACompilerId.cu" --orig_src_path_name "/home/ubuntu/thrust/build/CMakeFiles/3.26.4/CompilerIdCUDA/CMakeCUDACompilerId.cu" --allow_managed --m64 --parse_templates --gen_c_file_name "tmp/CMakeCUDACompilerId.cudafe1.cpp" --stub_file_name "CMakeCUDACompilerId.cudafe1.stub.c" --module_id_file_name "tmp/CMakeCUDACompilerId.module_id" "tmp/CMakeCUDACompilerId.cpp4.ii" ] | |
| considering line: ["/usr/bin"/c++ -D__CUDA_ARCH__=520 -D__CUDA_ARCH_LIST__=520 -c -x c++ -DCUDA_DOUBLE_MATH_FUNCTIONS -m64 "tmp/CMakeCUDACompilerId.cudafe1.cpp" -o "tmp/CMakeCUDACompilerId.o" ] | |
| considering line: [nvlink -m64 --arch=sm_52 --register-link-binaries="tmp/a_dlink.reg.c" -L/usr/lib/x86_64-linux-gnu/stubs -L/usr/lib/x86_64-linux-gnu -cpu-arch=X86_64 "tmp/CMakeCUDACompilerId.o" -lcudadevrt -o "tmp/a_dlink.sm_52.cubin" --host-ccbin "/usr/bin/c++"] | |
| ignoring nvlink line | |
| considering line: [fatbinary --create="tmp/a_dlink.fatbin" -64 --cicc-cmdline="-ftz=0 -prec_div=1 -prec_sqrt=1 -fmad=1 " -link "--image3=kind=elf,sm=52,file=tmp/a_dlink.sm_52.cubin" --embedded-fatbin="tmp/a_dlink.fatbin.c" ] | |
| considering line: ["/usr/bin"/c++ -D__CUDA_ARCH_LIST__=520 -c -x c++ -DFATBINFILE="\\"tmp/a_dlink.fatbin.c\\"" -DREGISTERLINKBINARYFILE="\\"tmp/a_dlink.reg.c\\"" -I. -D__NV_EXTRA_INITIALIZATION= -D__NV_EXTRA_FINALIZATION= -D__CUDA_INCLUDE_COMPILER_INTERNAL_HEADERS__ -D__CUDACC_VER_MAJOR__=11 -D__CUDACC_VER_MINOR__=8 -D__CUDACC_VER_BUILD__=89 -D__CUDA_API_VER_MAJOR__=11 -D__CUDA_API_VER_MINOR__=8 -D__NVCC_DIAG_PRAGMA_SUPPORT__=1 -m64 "/usr/lib/nvidia-cuda-toolkit/bin/crt/link.stub" -o "tmp/a_dlink.o" ] | |
| considering line: ["/usr/bin"/c++ -D__CUDA_ARCH_LIST__=520 -m64 -Wl,--start-group "tmp/a_dlink.o" "tmp/CMakeCUDACompilerId.o" -L/usr/lib/x86_64-linux-gnu/stubs -L/usr/lib/x86_64-linux-gnu -lcudadevrt -lcudart_static -lrt -lpthread -ldl -Wl,--end-group -o "a.out" ] | |
| extracted link line: ["/usr/bin"/c++ -D__CUDA_ARCH_LIST__=520 -m64 -Wl,--start-group "tmp/a_dlink.o" "tmp/CMakeCUDACompilerId.o" -L/usr/lib/x86_64-linux-gnu/stubs -L/usr/lib/x86_64-linux-gnu -lcudadevrt -lcudart_static -lrt -lpthread -ldl -Wl,--end-group -o "a.out" ] | |
| considering line: [] | |
| extracted link launcher absolute path: [/usr/bin/c++] | |
| link line regex: [^( *|.*[/\\])(ld|CMAKE_LINK_STARTFILE-NOTFOUND|([^/\\]+-)?ld|collect2)[^/\\]*( |$)] | |
| link line: [cuda-fake-ld "/usr/bin"/c++ -D__CUDA_ARCH_LIST__=520 -m64 -Wl,--start-group "tmp/a_dlink.o" "tmp/CMakeCUDACompilerId.o" -L/usr/lib/x86_64-linux-gnu/stubs -L/usr/lib/x86_64-linux-gnu -lcudadevrt -lcudart_static -lrt -lpthread -ldl -Wl,--end-group -o "a.out" ] | |
| arg [cuda-fake-ld] ==> ignore | |
| arg [/usr/bin/c++] ==> ignore | |
| arg [-D__CUDA_ARCH_LIST__=520] ==> ignore | |
| arg [-m64] ==> ignore | |
| arg [-Wl,--start-group] ==> ignore | |
| arg [tmp/a_dlink.o] ==> ignore | |
| arg [tmp/CMakeCUDACompilerId.o] ==> ignore | |
| arg [-L/usr/lib/x86_64-linux-gnu/stubs] ==> dir [/usr/lib/x86_64-linux-gnu/stubs] | |
| arg [-L/usr/lib/x86_64-linux-gnu] ==> dir [/usr/lib/x86_64-linux-gnu] | |
| arg [-lcudadevrt] ==> lib [cudadevrt] | |
| arg [-lcudart_static] ==> lib [cudart_static] | |
| arg [-lrt] ==> lib [rt] | |
| arg [-lpthread] ==> lib [pthread] | |
| arg [-ldl] ==> lib [dl] | |
| arg [-Wl,--end-group] ==> ignore | |
| arg [-o] ==> ignore | |
| arg [a.out] ==> ignore | |
| collapse library dir [/usr/lib/x86_64-linux-gnu/stubs] ==> [/usr/lib/x86_64-linux-gnu/stubs] | |
| collapse library dir [/usr/lib/x86_64-linux-gnu] ==> [/usr/lib/x86_64-linux-gnu] | |
| implicit libs: [cudadevrt;cudart_static;rt;pthread;dl] | |
| implicit objs: [] | |
| implicit dirs: [/usr/lib/x86_64-linux-gnu/stubs;/usr/lib/x86_64-linux-gnu] | |
| implicit fwks: [] | |
| - | |
| kind: "message-v1" | |
| backtrace: | |
| - "/usr/share/cmake-3.26/Modules/CMakeDetermineCUDACompiler.cmake:582 (message)" | |
| - "cmake/ThrustCudaConfig.cmake:1 (enable_language)" | |
| - "CMakeLists.txt:118 (include)" | |
| message: | | |
| Failed to detect CUDA nvcc include information: | |
| found 'PATH=' string: [/usr/lib/nvidia-cuda-toolkit/bin:/home/ubuntu/.local/bin:/home/ubuntu/.local/bin:/usr/local/sbin:/usr/local/bin:/usr/sbin:/usr/bin:/sbin:/bin:/usr/games:/usr/local/games:/snap/bin] | |
| found 'LIBRARIES=' string: [-L/usr/lib/x86_64-linux-gnu/stubs -L/usr/lib/x86_64-linux-gnu] | |
| considering line: [#$ rm tmp/a_dlink.reg.c] | |
| considering line: ["/usr/bin"/c++ -D__CUDA_ARCH__=520 -D__CUDA_ARCH_LIST__=520 -E -x c++ -DCUDA_DOUBLE_MATH_FUNCTIONS -D__CUDACC__ -D__NVCC__ -D__CUDACC_VER_MAJOR__=11 -D__CUDACC_VER_MINOR__=8 -D__CUDACC_VER_BUILD__=89 -D__CUDA_API_VER_MAJOR__=11 -D__CUDA_API_VER_MINOR__=8 -D__NVCC_DIAG_PRAGMA_SUPPORT__=1 -include "cuda_runtime.h" -m64 "CMakeCUDACompilerId.cu" -o "tmp/CMakeCUDACompilerId.cpp1.ii" ] | |
| considering line: [cicc --c++14 --gnu_version=90400 --display_error_number --orig_src_file_name "CMakeCUDACompilerId.cu" --orig_src_path_name "/home/ubuntu/thrust/build/CMakeFiles/3.26.4/CompilerIdCUDA/CMakeCUDACompilerId.cu" --allow_managed -arch compute_52 -m64 --no-version-ident -ftz=0 -prec_div=1 -prec_sqrt=1 -fmad=1 --include_file_name "CMakeCUDACompilerId.fatbin.c" -tused --gen_module_id_file --module_id_file_name "tmp/CMakeCUDACompilerId.module_id" --gen_c_file_name "tmp/CMakeCUDACompilerId.cudafe1.c" --stub_file_name "tmp/CMakeCUDACompilerId.cudafe1.stub.c" --gen_device_file_name "tmp/CMakeCUDACompilerId.cudafe1.gpu" "tmp/CMakeCUDACompilerId.cpp1.ii" -o "tmp/CMakeCUDACompilerId.ptx"] | |
| considering line: [ptxas -arch=sm_52 -m64 "tmp/CMakeCUDACompilerId.ptx" -o "tmp/CMakeCUDACompilerId.sm_52.cubin" ] | |
| considering line: [fatbinary --create="tmp/CMakeCUDACompilerId.fatbin" -64 --cicc-cmdline="-ftz=0 -prec_div=1 -prec_sqrt=1 -fmad=1 " "--image3=kind=elf,sm=52,file=tmp/CMakeCUDACompilerId.sm_52.cubin" "--image3=kind=ptx,sm=52,file=tmp/CMakeCUDACompilerId.ptx" --embedded-fatbin="tmp/CMakeCUDACompilerId.fatbin.c" ] | |
| considering line: ["/usr/bin"/c++ -D__CUDA_ARCH_LIST__=520 -E -x c++ -D__CUDACC__ -D__NVCC__ -D__CUDACC_VER_MAJOR__=11 -D__CUDACC_VER_MINOR__=8 -D__CUDACC_VER_BUILD__=89 -D__CUDA_API_VER_MAJOR__=11 -D__CUDA_API_VER_MINOR__=8 -D__NVCC_DIAG_PRAGMA_SUPPORT__=1 -include "cuda_runtime.h" -m64 "CMakeCUDACompilerId.cu" -o "tmp/CMakeCUDACompilerId.cpp4.ii" ] | |
| considering line: [cudafe++ --c++14 --gnu_version=90400 --display_error_number --orig_src_file_name "CMakeCUDACompilerId.cu" --orig_src_path_name "/home/ubuntu/thrust/build/CMakeFiles/3.26.4/CompilerIdCUDA/CMakeCUDACompilerId.cu" --allow_managed --m64 --parse_templates --gen_c_file_name "tmp/CMakeCUDACompilerId.cudafe1.cpp" --stub_file_name "CMakeCUDACompilerId.cudafe1.stub.c" --module_id_file_name "tmp/CMakeCUDACompilerId.module_id" "tmp/CMakeCUDACompilerId.cpp4.ii" ] | |
| considering line: ["/usr/bin"/c++ -D__CUDA_ARCH__=520 -D__CUDA_ARCH_LIST__=520 -c -x c++ -DCUDA_DOUBLE_MATH_FUNCTIONS -m64 "tmp/CMakeCUDACompilerId.cudafe1.cpp" -o "tmp/CMakeCUDACompilerId.o" ] | |
| considering line: [nvlink -m64 --arch=sm_52 --register-link-binaries="tmp/a_dlink.reg.c" -L/usr/lib/x86_64-linux-gnu/stubs -L/usr/lib/x86_64-linux-gnu -cpu-arch=X86_64 "tmp/CMakeCUDACompilerId.o" -lcudadevrt -o "tmp/a_dlink.sm_52.cubin" --host-ccbin "/usr/bin/c++"] | |
| ignoring nvlink line | |
| considering line: [fatbinary --create="tmp/a_dlink.fatbin" -64 --cicc-cmdline="-ftz=0 -prec_div=1 -prec_sqrt=1 -fmad=1 " -link "--image3=kind=elf,sm=52,file=tmp/a_dlink.sm_52.cubin" --embedded-fatbin="tmp/a_dlink.fatbin.c" ] | |
| considering line: ["/usr/bin"/c++ -D__CUDA_ARCH_LIST__=520 -c -x c++ -DFATBINFILE="\\"tmp/a_dlink.fatbin.c\\"" -DREGISTERLINKBINARYFILE="\\"tmp/a_dlink.reg.c\\"" -I. -D__NV_EXTRA_INITIALIZATION= -D__NV_EXTRA_FINALIZATION= -D__CUDA_INCLUDE_COMPILER_INTERNAL_HEADERS__ -D__CUDACC_VER_MAJOR__=11 -D__CUDACC_VER_MINOR__=8 -D__CUDACC_VER_BUILD__=89 -D__CUDA_API_VER_MAJOR__=11 -D__CUDA_API_VER_MINOR__=8 -D__NVCC_DIAG_PRAGMA_SUPPORT__=1 -m64 "/usr/lib/nvidia-cuda-toolkit/bin/crt/link.stub" -o "tmp/a_dlink.o" ] | |
| considering line: ["/usr/bin"/c++ -D__CUDA_ARCH_LIST__=520 -m64 -Wl,--start-group "tmp/a_dlink.o" "tmp/CMakeCUDACompilerId.o" -L/usr/lib/x86_64-linux-gnu/stubs -L/usr/lib/x86_64-linux-gnu -lcudadevrt -lcudart_static -lrt -lpthread -ldl -Wl,--end-group -o "a.out" ] | |
| extracted link line: ["/usr/bin"/c++ -D__CUDA_ARCH_LIST__=520 -m64 -Wl,--start-group "tmp/a_dlink.o" "tmp/CMakeCUDACompilerId.o" -L/usr/lib/x86_64-linux-gnu/stubs -L/usr/lib/x86_64-linux-gnu -lcudadevrt -lcudart_static -lrt -lpthread -ldl -Wl,--end-group -o "a.out" ] | |
| considering line: [] | |
| extracted link launcher absolute path: [/usr/bin/c++] | |
| no 'INCLUDES=' string found in nvcc output: | |
| #$ _NVVM_BRANCH_=nvvm | |
| #$ _SPACE_= | |
| #$ _CUDART_=cudart | |
| #$ _HERE_=/usr/lib/nvidia-cuda-toolkit/bin | |
| #$ _THERE_=/usr/lib/nvidia-cuda-toolkit/bin | |
| #$ _TARGET_SIZE_= | |
| #$ _TARGET_DIR_= | |
| #$ _TARGET_SIZE_=64 | |
| #$ NVVMIR_LIBRARY_DIR=/usr/lib/nvidia-cuda-toolkit/libdevice | |
| #$ PATH=/usr/lib/nvidia-cuda-toolkit/bin:/home/ubuntu/.local/bin:/home/ubuntu/.local/bin:/usr/local/sbin:/usr/local/bin:/usr/sbin:/usr/bin:/sbin:/bin:/usr/games:/usr/local/games:/snap/bin | |
| #$ LIBRARIES= -L/usr/lib/x86_64-linux-gnu/stubs -L/usr/lib/x86_64-linux-gnu | |
| #$ rm tmp/a_dlink.reg.c | |
| #$ "/usr/bin"/c++ -D__CUDA_ARCH__=520 -D__CUDA_ARCH_LIST__=520 -E -x c++ -DCUDA_DOUBLE_MATH_FUNCTIONS -D__CUDACC__ -D__NVCC__ -D__CUDACC_VER_MAJOR__=11 -D__CUDACC_VER_MINOR__=8 -D__CUDACC_VER_BUILD__=89 -D__CUDA_API_VER_MAJOR__=11 -D__CUDA_API_VER_MINOR__=8 -D__NVCC_DIAG_PRAGMA_SUPPORT__=1 -include "cuda_runtime.h" -m64 "CMakeCUDACompilerId.cu" -o "tmp/CMakeCUDACompilerId.cpp1.ii" | |
| #$ cicc --c++14 --gnu_version=90400 --display_error_number --orig_src_file_name "CMakeCUDACompilerId.cu" --orig_src_path_name "/home/ubuntu/thrust/build/CMakeFiles/3.26.4/CompilerIdCUDA/CMakeCUDACompilerId.cu" --allow_managed -arch compute_52 -m64 --no-version-ident -ftz=0 -prec_div=1 -prec_sqrt=1 -fmad=1 --include_file_name "CMakeCUDACompilerId.fatbin.c" -tused --gen_module_id_file --module_id_file_name "tmp/CMakeCUDACompilerId.module_id" --gen_c_file_name "tmp/CMakeCUDACompilerId.cudafe1.c" --stub_file_name "tmp/CMakeCUDACompilerId.cudafe1.stub.c" --gen_device_file_name "tmp/CMakeCUDACompilerId.cudafe1.gpu" "tmp/CMakeCUDACompilerId.cpp1.ii" -o "tmp/CMakeCUDACompilerId.ptx" | |
| #$ ptxas -arch=sm_52 -m64 "tmp/CMakeCUDACompilerId.ptx" -o "tmp/CMakeCUDACompilerId.sm_52.cubin" | |
| #$ fatbinary --create="tmp/CMakeCUDACompilerId.fatbin" -64 --cicc-cmdline="-ftz=0 -prec_div=1 -prec_sqrt=1 -fmad=1 " "--image3=kind=elf,sm=52,file=tmp/CMakeCUDACompilerId.sm_52.cubin" "--image3=kind=ptx,sm=52,file=tmp/CMakeCUDACompilerId.ptx" --embedded-fatbin="tmp/CMakeCUDACompilerId.fatbin.c" | |
| #$ "/usr/bin"/c++ -D__CUDA_ARCH_LIST__=520 -E -x c++ -D__CUDACC__ -D__NVCC__ -D__CUDACC_VER_MAJOR__=11 -D__CUDACC_VER_MINOR__=8 -D__CUDACC_VER_BUILD__=89 -D__CUDA_API_VER_MAJOR__=11 -D__CUDA_API_VER_MINOR__=8 -D__NVCC_DIAG_PRAGMA_SUPPORT__=1 -include "cuda_runtime.h" -m64 "CMakeCUDACompilerId.cu" -o "tmp/CMakeCUDACompilerId.cpp4.ii" | |
| #$ cudafe++ --c++14 --gnu_version=90400 --display_error_number --orig_src_file_name "CMakeCUDACompilerId.cu" --orig_src_path_name "/home/ubuntu/thrust/build/CMakeFiles/3.26.4/CompilerIdCUDA/CMakeCUDACompilerId.cu" --allow_managed --m64 --parse_templates --gen_c_file_name "tmp/CMakeCUDACompilerId.cudafe1.cpp" --stub_file_name "CMakeCUDACompilerId.cudafe1.stub.c" --module_id_file_name "tmp/CMakeCUDACompilerId.module_id" "tmp/CMakeCUDACompilerId.cpp4.ii" | |
| #$ "/usr/bin"/c++ -D__CUDA_ARCH__=520 -D__CUDA_ARCH_LIST__=520 -c -x c++ -DCUDA_DOUBLE_MATH_FUNCTIONS -m64 "tmp/CMakeCUDACompilerId.cudafe1.cpp" -o "tmp/CMakeCUDACompilerId.o" | |
| #$ nvlink -m64 --arch=sm_52 --register-link-binaries="tmp/a_dlink.reg.c" -L/usr/lib/x86_64-linux-gnu/stubs -L/usr/lib/x86_64-linux-gnu -cpu-arch=X86_64 "tmp/CMakeCUDACompilerId.o" -lcudadevrt -o "tmp/a_dlink.sm_52.cubin" --host-ccbin "/usr/bin/c++" | |
| #$ fatbinary --create="tmp/a_dlink.fatbin" -64 --cicc-cmdline="-ftz=0 -prec_div=1 -prec_sqrt=1 -fmad=1 " -link "--image3=kind=elf,sm=52,file=tmp/a_dlink.sm_52.cubin" --embedded-fatbin="tmp/a_dlink.fatbin.c" | |
| #$ "/usr/bin"/c++ -D__CUDA_ARCH_LIST__=520 -c -x c++ -DFATBINFILE="\\"tmp/a_dlink.fatbin.c\\"" -DREGISTERLINKBINARYFILE="\\"tmp/a_dlink.reg.c\\"" -I. -D__NV_EXTRA_INITIALIZATION= -D__NV_EXTRA_FINALIZATION= -D__CUDA_INCLUDE_COMPILER_INTERNAL_HEADERS__ -D__CUDACC_VER_MAJOR__=11 -D__CUDACC_VER_MINOR__=8 -D__CUDACC_VER_BUILD__=89 -D__CUDA_API_VER_MAJOR__=11 -D__CUDA_API_VER_MINOR__=8 -D__NVCC_DIAG_PRAGMA_SUPPORT__=1 -m64 "/usr/lib/nvidia-cuda-toolkit/bin/crt/link.stub" -o "tmp/a_dlink.o" | |
| #$ "/usr/bin"/c++ -D__CUDA_ARCH_LIST__=520 -m64 -Wl,--start-group "tmp/a_dlink.o" "tmp/CMakeCUDACompilerId.o" -L/usr/lib/x86_64-linux-gnu/stubs -L/usr/lib/x86_64-linux-gnu -lcudadevrt -lcudart_static -lrt -lpthread -ldl -Wl,--end-group -o "a.out" | |
| - | |
| kind: "try_compile-v1" | |
| backtrace: | |
| - "/usr/share/cmake-3.26/Modules/CMakeDetermineCompilerABI.cmake:57 (try_compile)" | |
| - "/usr/share/cmake-3.26/Modules/CMakeTestCUDACompiler.cmake:19 (CMAKE_DETERMINE_COMPILER_ABI)" | |
| - "cmake/ThrustCudaConfig.cmake:1 (enable_language)" | |
| - "CMakeLists.txt:118 (include)" | |
| checks: | |
| - "Detecting CUDA compiler ABI info" | |
| directories: | |
| source: "/home/ubuntu/thrust/build/CMakeFiles/CMakeScratch/TryCompile-a3dq1D" | |
| binary: "/home/ubuntu/thrust/build/CMakeFiles/CMakeScratch/TryCompile-a3dq1D" | |
| cmakeVariables: | |
| CMAKE_CUDA_FLAGS: "" | |
| CMAKE_CUDA_FLAGS_DEBUG: "-g" | |
| CMAKE_CUDA_RUNTIME_LIBRARY: "Static" | |
| CMAKE_EXE_LINKER_FLAGS: "" | |
| buildResult: | |
| variable: "CMAKE_CUDA_ABI_COMPILED" | |
| cached: true | |
| stdout: | | |
| Change Dir: /home/ubuntu/thrust/build/CMakeFiles/CMakeScratch/TryCompile-a3dq1D | |
| Run Build Command(s):/usr/bin/cmake -E env VERBOSE=1 /usr/bin/make -f Makefile cmTC_2f539/fast && /usr/bin/make -f CMakeFiles/cmTC_2f539.dir/build.make CMakeFiles/cmTC_2f539.dir/build | |
| make[1]: Entering directory '/home/ubuntu/thrust/build/CMakeFiles/CMakeScratch/TryCompile-a3dq1D' | |
| Building CUDA object CMakeFiles/cmTC_2f539.dir/CMakeCUDACompilerABI.cu.o | |
| /usr/bin/nvcc -forward-unknown-to-host-compiler -ccbin=/usr/bin/c++ -Xcompiler=-v -MD -MT CMakeFiles/cmTC_2f539.dir/CMakeCUDACompilerABI.cu.o -MF CMakeFiles/cmTC_2f539.dir/CMakeCUDACompilerABI.cu.o.d -x cu -c /usr/share/cmake-3.26/Modules/CMakeCUDACompilerABI.cu -o CMakeFiles/cmTC_2f539.dir/CMakeCUDACompilerABI.cu.o | |
| Using built-in specs. | |
| COLLECT_GCC=/usr/bin/c++ | |
| OFFLOAD_TARGET_NAMES=nvptx-none:hsa | |
| OFFLOAD_TARGET_DEFAULT=1 | |
| Target: x86_64-linux-gnu | |
| Configured with: ../src/configure -v --with-pkgversion='Ubuntu 9.4.0-1ubuntu1~20.04.1' --with-bugurl=file:///usr/share/doc/gcc-9/README.Bugs --enable-languages=c,ada,c++,go,brig,d,fortran,objc,obj-c++,gm2 --prefix=/usr --with-gcc-major-version-only --program-suffix=-9 --program-prefix=x86_64-linux-gnu- --enable-shared --enable-linker-build-id --libexecdir=/usr/lib --without-included-gettext --enable-threads=posix --libdir=/usr/lib --enable-nls --enable-clocale=gnu --enable-libstdcxx-debug --enable-libstdcxx-time=yes --with-default-libstdcxx-abi=new --enable-gnu-unique-object --disable-vtable-verify --enable-plugin --enable-default-pie --with-system-zlib --with-target-system-zlib=auto --enable-objc-gc=auto --enable-multiarch --disable-werror --with-arch-32=i686 --with-abi=m64 --with-multilib-list=m32,m64,mx32 --enable-multilib --with-tune=generic --enable-offload-targets=nvptx-none=/build/gcc-9-Av3uEd/gcc-9-9.4.0/debian/tmp-nvptx/usr,hsa --without-cuda-driver --enable-checking=release --build=x86_64-linux-gnu --host=x86_64-linux-gnu --target=x86_64-linux-gnu | |
| Thread model: posix | |
| gcc version 9.4.0 (Ubuntu 9.4.0-1ubuntu1~20.04.1) | |
| COLLECT_GCC_OPTIONS='-D' '__CUDA_ARCH__=520' '-D' '__CUDA_ARCH_LIST__=520' '-E' '-D' 'CUDA_DOUBLE_MATH_FUNCTIONS' '-D' '__CUDACC__' '-D' '__NVCC__' '-v' '-D' '__CUDACC_VER_MAJOR__=11' '-D' '__CUDACC_VER_MINOR__=8' '-D' '__CUDACC_VER_BUILD__=89' '-D' '__CUDA_API_VER_MAJOR__=11' '-D' '__CUDA_API_VER_MINOR__=8' '-D' '__NVCC_DIAG_PRAGMA_SUPPORT__=1' '-include' 'cuda_runtime.h' '-m64' '-o' '/tmp/tmpxft_00076fd8_00000000-7_CMakeCUDACompilerABI.cpp1.ii' '-shared-libgcc' '-mtune=generic' '-march=x86-64' | |
| /usr/lib/gcc/x86_64-linux-gnu/9/cc1plus -E -quiet -v -imultiarch x86_64-linux-gnu -D_GNU_SOURCE -D __CUDA_ARCH__=520 -D __CUDA_ARCH_LIST__=520 -D CUDA_DOUBLE_MATH_FUNCTIONS -D __CUDACC__ -D __NVCC__ -D __CUDACC_VER_MAJOR__=11 -D __CUDACC_VER_MINOR__=8 -D __CUDACC_VER_BUILD__=89 -D __CUDA_API_VER_MAJOR__=11 -D __CUDA_API_VER_MINOR__=8 -D __NVCC_DIAG_PRAGMA_SUPPORT__=1 -include cuda_runtime.h /usr/share/cmake-3.26/Modules/CMakeCUDACompilerABI.cu -o /tmp/tmpxft_00076fd8_00000000-7_CMakeCUDACompilerABI.cpp1.ii -m64 -mtune=generic -march=x86-64 -fasynchronous-unwind-tables -fstack-protector-strong -Wformat -Wformat-security -fstack-clash-protection -fcf-protection | |
| ignoring duplicate directory "/usr/include/x86_64-linux-gnu/c++/9" | |
| ignoring nonexistent directory "/usr/local/include/x86_64-linux-gnu" | |
| ignoring nonexistent directory "/usr/lib/gcc/x86_64-linux-gnu/9/include-fixed" | |
| ignoring nonexistent directory "/usr/lib/gcc/x86_64-linux-gnu/9/../../../../x86_64-linux-gnu/include" | |
| #include "..." search starts here: | |
| #include <...> search starts here: | |
| /usr/include/c++/9 | |
| /usr/include/x86_64-linux-gnu/c++/9 | |
| /usr/include/c++/9/backward | |
| /usr/lib/gcc/x86_64-linux-gnu/9/include | |
| /usr/local/include | |
| /usr/include/x86_64-linux-gnu | |
| /usr/include | |
| End of search list. | |
| COMPILER_PATH=/usr/lib/gcc/x86_64-linux-gnu/9/:/usr/lib/gcc/x86_64-linux-gnu/9/:/usr/lib/gcc/x86_64-linux-gnu/:/usr/lib/gcc/x86_64-linux-gnu/9/:/usr/lib/gcc/x86_64-linux-gnu/ | |
| LIBRARY_PATH=/usr/lib/gcc/x86_64-linux-gnu/9/:/usr/lib/gcc/x86_64-linux-gnu/9/../../../x86_64-linux-gnu/:/usr/lib/gcc/x86_64-linux-gnu/9/../../../../lib/:/lib/x86_64-linux-gnu/:/lib/../lib/:/usr/lib/x86_64-linux-gnu/:/usr/lib/../lib/:/usr/lib/gcc/x86_64-linux-gnu/9/../../../:/lib/:/usr/lib/ | |
| COLLECT_GCC_OPTIONS='-D' '__CUDA_ARCH__=520' '-D' '__CUDA_ARCH_LIST__=520' '-E' '-D' 'CUDA_DOUBLE_MATH_FUNCTIONS' '-D' '__CUDACC__' '-D' '__NVCC__' '-v' '-D' '__CUDACC_VER_MAJOR__=11' '-D' '__CUDACC_VER_MINOR__=8' '-D' '__CUDACC_VER_BUILD__=89' '-D' '__CUDA_API_VER_MAJOR__=11' '-D' '__CUDA_API_VER_MINOR__=8' '-D' '__NVCC_DIAG_PRAGMA_SUPPORT__=1' '-include' 'cuda_runtime.h' '-m64' '-o' '/tmp/tmpxft_00076fd8_00000000-7_CMakeCUDACompilerABI.cpp1.ii' '-shared-libgcc' '-mtune=generic' '-march=x86-64' | |
| Using built-in specs. | |
| COLLECT_GCC=/usr/bin/c++ | |
| OFFLOAD_TARGET_NAMES=nvptx-none:hsa | |
| OFFLOAD_TARGET_DEFAULT=1 | |
| Target: x86_64-linux-gnu | |
| Configured with: ../src/configure -v --with-pkgversion='Ubuntu 9.4.0-1ubuntu1~20.04.1' --with-bugurl=file:///usr/share/doc/gcc-9/README.Bugs --enable-languages=c,ada,c++,go,brig,d,fortran,objc,obj-c++,gm2 --prefix=/usr --with-gcc-major-version-only --program-suffix=-9 --program-prefix=x86_64-linux-gnu- --enable-shared --enable-linker-build-id --libexecdir=/usr/lib --without-included-gettext --enable-threads=posix --libdir=/usr/lib --enable-nls --enable-clocale=gnu --enable-libstdcxx-debug --enable-libstdcxx-time=yes --with-default-libstdcxx-abi=new --enable-gnu-unique-object --disable-vtable-verify --enable-plugin --enable-default-pie --with-system-zlib --with-target-system-zlib=auto --enable-objc-gc=auto --enable-multiarch --disable-werror --with-arch-32=i686 --with-abi=m64 --with-multilib-list=m32,m64,mx32 --enable-multilib --with-tune=generic --enable-offload-targets=nvptx-none=/build/gcc-9-Av3uEd/gcc-9-9.4.0/debian/tmp-nvptx/usr,hsa --without-cuda-driver --enable-checking=release --build=x86_64-linux-gnu --host=x86_64-linux-gnu --target=x86_64-linux-gnu | |
| Thread model: posix | |
| gcc version 9.4.0 (Ubuntu 9.4.0-1ubuntu1~20.04.1) | |
| COLLECT_GCC_OPTIONS='-D' '__CUDA_ARCH_LIST__=520' '-E' '-D' '__CUDACC__' '-D' '__NVCC__' '-v' '-D' '__CUDACC_VER_MAJOR__=11' '-D' '__CUDACC_VER_MINOR__=8' '-D' '__CUDACC_VER_BUILD__=89' '-D' '__CUDA_API_VER_MAJOR__=11' '-D' '__CUDA_API_VER_MINOR__=8' '-D' '__NVCC_DIAG_PRAGMA_SUPPORT__=1' '-include' 'cuda_runtime.h' '-m64' '-o' '/tmp/tmpxft_00076fd8_00000000-5_CMakeCUDACompilerABI.cpp4.ii' '-shared-libgcc' '-mtune=generic' '-march=x86-64' | |
| /usr/lib/gcc/x86_64-linux-gnu/9/cc1plus -E -quiet -v -imultiarch x86_64-linux-gnu -D_GNU_SOURCE -D __CUDA_ARCH_LIST__=520 -D __CUDACC__ -D __NVCC__ -D __CUDACC_VER_MAJOR__=11 -D __CUDACC_VER_MINOR__=8 -D __CUDACC_VER_BUILD__=89 -D __CUDA_API_VER_MAJOR__=11 -D __CUDA_API_VER_MINOR__=8 -D __NVCC_DIAG_PRAGMA_SUPPORT__=1 -include cuda_runtime.h /usr/share/cmake-3.26/Modules/CMakeCUDACompilerABI.cu -o /tmp/tmpxft_00076fd8_00000000-5_CMakeCUDACompilerABI.cpp4.ii -m64 -mtune=generic -march=x86-64 -fasynchronous-unwind-tables -fstack-protector-strong -Wformat -Wformat-security -fstack-clash-protection -fcf-protection | |
| ignoring duplicate directory "/usr/include/x86_64-linux-gnu/c++/9" | |
| ignoring nonexistent directory "/usr/local/include/x86_64-linux-gnu" | |
| ignoring nonexistent directory "/usr/lib/gcc/x86_64-linux-gnu/9/include-fixed" | |
| ignoring nonexistent directory "/usr/lib/gcc/x86_64-linux-gnu/9/../../../../x86_64-linux-gnu/include" | |
| #include "..." search starts here: | |
| #include <...> search starts here: | |
| /usr/include/c++/9 | |
| /usr/include/x86_64-linux-gnu/c++/9 | |
| /usr/include/c++/9/backward | |
| /usr/lib/gcc/x86_64-linux-gnu/9/include | |
| /usr/local/include | |
| /usr/include/x86_64-linux-gnu | |
| /usr/include | |
| End of search list. | |
| COMPILER_PATH=/usr/lib/gcc/x86_64-linux-gnu/9/:/usr/lib/gcc/x86_64-linux-gnu/9/:/usr/lib/gcc/x86_64-linux-gnu/:/usr/lib/gcc/x86_64-linux-gnu/9/:/usr/lib/gcc/x86_64-linux-gnu/ | |
| LIBRARY_PATH=/usr/lib/gcc/x86_64-linux-gnu/9/:/usr/lib/gcc/x86_64-linux-gnu/9/../../../x86_64-linux-gnu/:/usr/lib/gcc/x86_64-linux-gnu/9/../../../../lib/:/lib/x86_64-linux-gnu/:/lib/../lib/:/usr/lib/x86_64-linux-gnu/:/usr/lib/../lib/:/usr/lib/gcc/x86_64-linux-gnu/9/../../../:/lib/:/usr/lib/ | |
| COLLECT_GCC_OPTIONS='-D' '__CUDA_ARCH_LIST__=520' '-E' '-D' '__CUDACC__' '-D' '__NVCC__' '-v' '-D' '__CUDACC_VER_MAJOR__=11' '-D' '__CUDACC_VER_MINOR__=8' '-D' '__CUDACC_VER_BUILD__=89' '-D' '__CUDA_API_VER_MAJOR__=11' '-D' '__CUDA_API_VER_MINOR__=8' '-D' '__NVCC_DIAG_PRAGMA_SUPPORT__=1' '-include' 'cuda_runtime.h' '-m64' '-o' '/tmp/tmpxft_00076fd8_00000000-5_CMakeCUDACompilerABI.cpp4.ii' '-shared-libgcc' '-mtune=generic' '-march=x86-64' | |
| Using built-in specs. | |
| COLLECT_GCC=/usr/bin/c++ | |
| OFFLOAD_TARGET_NAMES=nvptx-none:hsa | |
| OFFLOAD_TARGET_DEFAULT=1 | |
| Target: x86_64-linux-gnu | |
| Configured with: ../src/configure -v --with-pkgversion='Ubuntu 9.4.0-1ubuntu1~20.04.1' --with-bugurl=file:///usr/share/doc/gcc-9/README.Bugs --enable-languages=c,ada,c++,go,brig,d,fortran,objc,obj-c++,gm2 --prefix=/usr --with-gcc-major-version-only --program-suffix=-9 --program-prefix=x86_64-linux-gnu- --enable-shared --enable-linker-build-id --libexecdir=/usr/lib --without-included-gettext --enable-threads=posix --libdir=/usr/lib --enable-nls --enable-clocale=gnu --enable-libstdcxx-debug --enable-libstdcxx-time=yes --with-default-libstdcxx-abi=new --enable-gnu-unique-object --disable-vtable-verify --enable-plugin --enable-default-pie --with-system-zlib --with-target-system-zlib=auto --enable-objc-gc=auto --enable-multiarch --disable-werror --with-arch-32=i686 --with-abi=m64 --with-multilib-list=m32,m64,mx32 --enable-multilib --with-tune=generic --enable-offload-targets=nvptx-none=/build/gcc-9-Av3uEd/gcc-9-9.4.0/debian/tmp-nvptx/usr,hsa --without-cuda-driver --enable-checking=release --build=x86_64-linux-gnu --host=x86_64-linux-gnu --target=x86_64-linux-gnu | |
| Thread model: posix | |
| gcc version 9.4.0 (Ubuntu 9.4.0-1ubuntu1~20.04.1) | |
| COLLECT_GCC_OPTIONS='-D' '__CUDA_ARCH__=520' '-D' '__CUDA_ARCH_LIST__=520' '-c' '-D' 'CUDA_DOUBLE_MATH_FUNCTIONS' '-v' '-m64' '-o' 'CMakeFiles/cmTC_2f539.dir/CMakeCUDACompilerABI.cu.o' '-shared-libgcc' '-mtune=generic' '-march=x86-64' | |
| /usr/lib/gcc/x86_64-linux-gnu/9/cc1plus -quiet -v -imultiarch x86_64-linux-gnu -D_GNU_SOURCE -D __CUDA_ARCH__=520 -D __CUDA_ARCH_LIST__=520 -D CUDA_DOUBLE_MATH_FUNCTIONS /tmp/tmpxft_00076fd8_00000000-6_CMakeCUDACompilerABI.cudafe1.cpp -quiet -dumpbase tmpxft_00076fd8_00000000-6_CMakeCUDACompilerABI.cudafe1.cpp -m64 -mtune=generic -march=x86-64 -auxbase-strip CMakeFiles/cmTC_2f539.dir/CMakeCUDACompilerABI.cu.o -version -fasynchronous-unwind-tables -fstack-protector-strong -Wformat -Wformat-security -fstack-clash-protection -fcf-protection -o /tmp/ccrXz90j.s | |
| GNU C++14 (Ubuntu 9.4.0-1ubuntu1~20.04.1) version 9.4.0 (x86_64-linux-gnu) | |
| compiled by GNU C version 9.4.0, GMP version 6.2.0, MPFR version 4.0.2, MPC version 1.1.0, isl version isl-0.22.1-GMP | |
| GGC heuristics: --param ggc-min-expand=100 --param ggc-min-heapsize=131072 | |
| ignoring duplicate directory "/usr/include/x86_64-linux-gnu/c++/9" | |
| ignoring nonexistent directory "/usr/local/include/x86_64-linux-gnu" | |
| ignoring nonexistent directory "/usr/lib/gcc/x86_64-linux-gnu/9/include-fixed" | |
| ignoring nonexistent directory "/usr/lib/gcc/x86_64-linux-gnu/9/../../../../x86_64-linux-gnu/include" | |
| #include "..." search starts here: | |
| #include <...> search starts here: | |
| /usr/include/c++/9 | |
| /usr/include/x86_64-linux-gnu/c++/9 | |
| /usr/include/c++/9/backward | |
| /usr/lib/gcc/x86_64-linux-gnu/9/include | |
| /usr/local/include | |
| /usr/include/x86_64-linux-gnu | |
| /usr/include | |
| End of search list. | |
| GNU C++14 (Ubuntu 9.4.0-1ubuntu1~20.04.1) version 9.4.0 (x86_64-linux-gnu) | |
| compiled by GNU C version 9.4.0, GMP version 6.2.0, MPFR version 4.0.2, MPC version 1.1.0, isl version isl-0.22.1-GMP | |
| GGC heuristics: --param ggc-min-expand=100 --param ggc-min-heapsize=131072 | |
| Compiler executable checksum: 65fe925b83d3956b533de4aaba7dace0 | |
| COLLECT_GCC_OPTIONS='-D' '__CUDA_ARCH__=520' '-D' '__CUDA_ARCH_LIST__=520' '-c' '-D' 'CUDA_DOUBLE_MATH_FUNCTIONS' '-v' '-m64' '-o' 'CMakeFiles/cmTC_2f539.dir/CMakeCUDACompilerABI.cu.o' '-shared-libgcc' '-mtune=generic' '-march=x86-64' | |
| as -v --64 -o CMakeFiles/cmTC_2f539.dir/CMakeCUDACompilerABI.cu.o /tmp/ccrXz90j.s | |
| GNU assembler version 2.34 (x86_64-linux-gnu) using BFD version (GNU Binutils for Ubuntu) 2.34 | |
| COMPILER_PATH=/usr/lib/gcc/x86_64-linux-gnu/9/:/usr/lib/gcc/x86_64-linux-gnu/9/:/usr/lib/gcc/x86_64-linux-gnu/:/usr/lib/gcc/x86_64-linux-gnu/9/:/usr/lib/gcc/x86_64-linux-gnu/ | |
| LIBRARY_PATH=/usr/lib/gcc/x86_64-linux-gnu/9/:/usr/lib/gcc/x86_64-linux-gnu/9/../../../x86_64-linux-gnu/:/usr/lib/gcc/x86_64-linux-gnu/9/../../../../lib/:/lib/x86_64-linux-gnu/:/lib/../lib/:/usr/lib/x86_64-linux-gnu/:/usr/lib/../lib/:/usr/lib/gcc/x86_64-linux-gnu/9/../../../:/lib/:/usr/lib/ | |
| COLLECT_GCC_OPTIONS='-D' '__CUDA_ARCH__=520' '-D' '__CUDA_ARCH_LIST__=520' '-c' '-D' 'CUDA_DOUBLE_MATH_FUNCTIONS' '-v' '-m64' '-o' 'CMakeFiles/cmTC_2f539.dir/CMakeCUDACompilerABI.cu.o' '-shared-libgcc' '-mtune=generic' '-march=x86-64' | |
| Linking CUDA executable cmTC_2f539 | |
| /usr/bin/cmake -E cmake_link_script CMakeFiles/cmTC_2f539.dir/link.txt --verbose=1 | |
| /usr/bin/c++ -v CMakeFiles/cmTC_2f539.dir/CMakeCUDACompilerABI.cu.o -o cmTC_2f539 -lcudadevrt -lcudart_static -lrt -lpthread -ldl -L"/usr/lib/x86_64-linux-gnu/stubs" -L"/usr/lib/x86_64-linux-gnu" | |
| Using built-in specs. | |
| COLLECT_GCC=/usr/bin/c++ | |
| COLLECT_LTO_WRAPPER=/usr/lib/gcc/x86_64-linux-gnu/9/lto-wrapper | |
| OFFLOAD_TARGET_NAMES=nvptx-none:hsa | |
| OFFLOAD_TARGET_DEFAULT=1 | |
| Target: x86_64-linux-gnu | |
| Configured with: ../src/configure -v --with-pkgversion='Ubuntu 9.4.0-1ubuntu1~20.04.1' --with-bugurl=file:///usr/share/doc/gcc-9/README.Bugs --enable-languages=c,ada,c++,go,brig,d,fortran,objc,obj-c++,gm2 --prefix=/usr --with-gcc-major-version-only --program-suffix=-9 --program-prefix=x86_64-linux-gnu- --enable-shared --enable-linker-build-id --libexecdir=/usr/lib --without-included-gettext --enable-threads=posix --libdir=/usr/lib --enable-nls --enable-clocale=gnu --enable-libstdcxx-debug --enable-libstdcxx-time=yes --with-default-libstdcxx-abi=new --enable-gnu-unique-object --disable-vtable-verify --enable-plugin --enable-default-pie --with-system-zlib --with-target-system-zlib=auto --enable-objc-gc=auto --enable-multiarch --disable-werror --with-arch-32=i686 --with-abi=m64 --with-multilib-list=m32,m64,mx32 --enable-multilib --with-tune=generic --enable-offload-targets=nvptx-none=/build/gcc-9-Av3uEd/gcc-9-9.4.0/debian/tmp-nvptx/usr,hsa --without-cuda-driver --enable-checking=release --build=x86_64-linux-gnu --host=x86_64-linux-gnu --target=x86_64-linux-gnu | |
| Thread model: posix | |
| gcc version 9.4.0 (Ubuntu 9.4.0-1ubuntu1~20.04.1) | |
| COMPILER_PATH=/usr/lib/gcc/x86_64-linux-gnu/9/:/usr/lib/gcc/x86_64-linux-gnu/9/:/usr/lib/gcc/x86_64-linux-gnu/:/usr/lib/gcc/x86_64-linux-gnu/9/:/usr/lib/gcc/x86_64-linux-gnu/ | |
| LIBRARY_PATH=/usr/lib/gcc/x86_64-linux-gnu/9/:/usr/lib/gcc/x86_64-linux-gnu/9/../../../x86_64-linux-gnu/:/usr/lib/gcc/x86_64-linux-gnu/9/../../../../lib/:/lib/x86_64-linux-gnu/:/lib/../lib/:/usr/lib/x86_64-linux-gnu/:/usr/lib/../lib/:/usr/lib/gcc/x86_64-linux-gnu/9/../../../:/lib/:/usr/lib/ | |
| COLLECT_GCC_OPTIONS='-v' '-o' 'cmTC_2f539' '-L/usr/lib/x86_64-linux-gnu/stubs' '-L/usr/lib/x86_64-linux-gnu' '-shared-libgcc' '-mtune=generic' '-march=x86-64' | |
| /usr/lib/gcc/x86_64-linux-gnu/9/collect2 -plugin /usr/lib/gcc/x86_64-linux-gnu/9/liblto_plugin.so -plugin-opt=/usr/lib/gcc/x86_64-linux-gnu/9/lto-wrapper -plugin-opt=-fresolution=/tmp/ccKq0MUL.res -plugin-opt=-pass-through=-lgcc_s -plugin-opt=-pass-through=-lgcc -plugin-opt=-pass-through=-lc -plugin-opt=-pass-through=-lgcc_s -plugin-opt=-pass-through=-lgcc --build-id --eh-frame-hdr -m elf_x86_64 --hash-style=gnu --as-needed -dynamic-linker /lib64/ld-linux-x86-64.so.2 -pie -z now -z relro -o cmTC_2f539 /usr/lib/gcc/x86_64-linux-gnu/9/../../../x86_64-linux-gnu/Scrt1.o /usr/lib/gcc/x86_64-linux-gnu/9/../../../x86_64-linux-gnu/crti.o /usr/lib/gcc/x86_64-linux-gnu/9/crtbeginS.o -L/usr/lib/x86_64-linux-gnu/stubs -L/usr/lib/x86_64-linux-gnu -L/usr/lib/gcc/x86_64-linux-gnu/9 -L/usr/lib/gcc/x86_64-linux-gnu/9/../../../x86_64-linux-gnu -L/usr/lib/gcc/x86_64-linux-gnu/9/../../../../lib -L/lib/x86_64-linux-gnu -L/lib/../lib -L/usr/lib/x86_64-linux-gnu -L/usr/lib/../lib -L/usr/lib/gcc/x86_64-linux-gnu/9/../../.. CMakeFiles/cmTC_2f539.dir/CMakeCUDACompilerABI.cu.o -lcudadevrt -lcudart_static -lrt -lpthread -ldl -lstdc++ -lm -lgcc_s -lgcc -lc -lgcc_s -lgcc /usr/lib/gcc/x86_64-linux-gnu/9/crtendS.o /usr/lib/gcc/x86_64-linux-gnu/9/../../../x86_64-linux-gnu/crtn.o | |
| COLLECT_GCC_OPTIONS='-v' '-o' 'cmTC_2f539' '-L/usr/lib/x86_64-linux-gnu/stubs' '-L/usr/lib/x86_64-linux-gnu' '-shared-libgcc' '-mtune=generic' '-march=x86-64' | |
| make[1]: Leaving directory '/home/ubuntu/thrust/build/CMakeFiles/CMakeScratch/TryCompile-a3dq1D' | |
| exitCode: 0 | |
| - | |
| kind: "message-v1" | |
| backtrace: | |
| - "/usr/share/cmake-3.26/Modules/CMakeDetermineCompilerABI.cmake:127 (message)" | |
| - "/usr/share/cmake-3.26/Modules/CMakeTestCUDACompiler.cmake:19 (CMAKE_DETERMINE_COMPILER_ABI)" | |
| - "cmake/ThrustCudaConfig.cmake:1 (enable_language)" | |
| - "CMakeLists.txt:118 (include)" | |
| message: | | |
| Parsed CUDA implicit include dir info: rv=done | |
| found start of include info | |
| found start of implicit include info | |
| add: [/usr/include/c++/9] | |
| add: [/usr/include/x86_64-linux-gnu/c++/9] | |
| add: [/usr/include/c++/9/backward] | |
| add: [/usr/lib/gcc/x86_64-linux-gnu/9/include] | |
| add: [/usr/local/include] | |
| add: [/usr/include/x86_64-linux-gnu] | |
| add: [/usr/include] | |
| end of search list found | |
| collapse include dir [/usr/include/c++/9] ==> [/usr/include/c++/9] | |
| collapse include dir [/usr/include/x86_64-linux-gnu/c++/9] ==> [/usr/include/x86_64-linux-gnu/c++/9] | |
| collapse include dir [/usr/include/c++/9/backward] ==> [/usr/include/c++/9/backward] | |
| collapse include dir [/usr/lib/gcc/x86_64-linux-gnu/9/include] ==> [/usr/lib/gcc/x86_64-linux-gnu/9/include] | |
| collapse include dir [/usr/local/include] ==> [/usr/local/include] | |
| collapse include dir [/usr/include/x86_64-linux-gnu] ==> [/usr/include/x86_64-linux-gnu] | |
| collapse include dir [/usr/include] ==> [/usr/include] | |
| implicit include dirs: [/usr/include/c++/9;/usr/include/x86_64-linux-gnu/c++/9;/usr/include/c++/9/backward;/usr/lib/gcc/x86_64-linux-gnu/9/include;/usr/local/include;/usr/include/x86_64-linux-gnu;/usr/include] | |
| - | |
| kind: "message-v1" | |
| backtrace: | |
| - "/usr/share/cmake-3.26/Modules/CMakeDetermineCompilerABI.cmake:152 (message)" | |
| - "/usr/share/cmake-3.26/Modules/CMakeTestCUDACompiler.cmake:19 (CMAKE_DETERMINE_COMPILER_ABI)" | |
| - "cmake/ThrustCudaConfig.cmake:1 (enable_language)" | |
| - "CMakeLists.txt:118 (include)" | |
| message: | | |
| Parsed CUDA implicit link information: | |
| link line regex: [^( *|.*[/\\])(ld|CMAKE_LINK_STARTFILE-NOTFOUND|([^/\\]+-)?ld|collect2)[^/\\]*( |$)] | |
| ignore line: [Change Dir: /home/ubuntu/thrust/build/CMakeFiles/CMakeScratch/TryCompile-a3dq1D] | |
| ignore line: [] | |
| ignore line: [Run Build Command(s):/usr/bin/cmake -E env VERBOSE=1 /usr/bin/make -f Makefile cmTC_2f539/fast && /usr/bin/make -f CMakeFiles/cmTC_2f539.dir/build.make CMakeFiles/cmTC_2f539.dir/build] | |
| ignore line: [make[1]: Entering directory '/home/ubuntu/thrust/build/CMakeFiles/CMakeScratch/TryCompile-a3dq1D'] | |
| ignore line: [Building CUDA object CMakeFiles/cmTC_2f539.dir/CMakeCUDACompilerABI.cu.o] | |
| ignore line: [/usr/bin/nvcc -forward-unknown-to-host-compiler -ccbin=/usr/bin/c++ -Xcompiler=-v -MD -MT CMakeFiles/cmTC_2f539.dir/CMakeCUDACompilerABI.cu.o -MF CMakeFiles/cmTC_2f539.dir/CMakeCUDACompilerABI.cu.o.d -x cu -c /usr/share/cmake-3.26/Modules/CMakeCUDACompilerABI.cu -o CMakeFiles/cmTC_2f539.dir/CMakeCUDACompilerABI.cu.o] | |
| ignore line: [Using built-in specs.] | |
| ignore line: [COLLECT_GCC=/usr/bin/c++] | |
| ignore line: [OFFLOAD_TARGET_NAMES=nvptx-none:hsa] | |
| ignore line: [OFFLOAD_TARGET_DEFAULT=1] | |
| ignore line: [Target: x86_64-linux-gnu] | |
| ignore line: [Configured with: ../src/configure -v --with-pkgversion='Ubuntu 9.4.0-1ubuntu1~20.04.1' --with-bugurl=file:///usr/share/doc/gcc-9/README.Bugs --enable-languages=c ada c++ go brig d fortran objc obj-c++ gm2 --prefix=/usr --with-gcc-major-version-only --program-suffix=-9 --program-prefix=x86_64-linux-gnu- --enable-shared --enable-linker-build-id --libexecdir=/usr/lib --without-included-gettext --enable-threads=posix --libdir=/usr/lib --enable-nls --enable-clocale=gnu --enable-libstdcxx-debug --enable-libstdcxx-time=yes --with-default-libstdcxx-abi=new --enable-gnu-unique-object --disable-vtable-verify --enable-plugin --enable-default-pie --with-system-zlib --with-target-system-zlib=auto --enable-objc-gc=auto --enable-multiarch --disable-werror --with-arch-32=i686 --with-abi=m64 --with-multilib-list=m32 m64 mx32 --enable-multilib --with-tune=generic --enable-offload-targets=nvptx-none=/build/gcc-9-Av3uEd/gcc-9-9.4.0/debian/tmp-nvptx/usr hsa --without-cuda-driver --enable-checking=release --build=x86_64-linux-gnu --host=x86_64-linux-gnu --target=x86_64-linux-gnu] | |
| ignore line: [Thread model: posix] | |
| ignore line: [gcc version 9.4.0 (Ubuntu 9.4.0-1ubuntu1~20.04.1) ] | |
| ignore line: [COLLECT_GCC_OPTIONS='-D' '__CUDA_ARCH__=520' '-D' '__CUDA_ARCH_LIST__=520' '-E' '-D' 'CUDA_DOUBLE_MATH_FUNCTIONS' '-D' '__CUDACC__' '-D' '__NVCC__' '-v' '-D' '__CUDACC_VER_MAJOR__=11' '-D' '__CUDACC_VER_MINOR__=8' '-D' '__CUDACC_VER_BUILD__=89' '-D' '__CUDA_API_VER_MAJOR__=11' '-D' '__CUDA_API_VER_MINOR__=8' '-D' '__NVCC_DIAG_PRAGMA_SUPPORT__=1' '-include' 'cuda_runtime.h' '-m64' '-o' '/tmp/tmpxft_00076fd8_00000000-7_CMakeCUDACompilerABI.cpp1.ii' '-shared-libgcc' '-mtune=generic' '-march=x86-64'] | |
| ignore line: [ /usr/lib/gcc/x86_64-linux-gnu/9/cc1plus -E -quiet -v -imultiarch x86_64-linux-gnu -D_GNU_SOURCE -D __CUDA_ARCH__=520 -D __CUDA_ARCH_LIST__=520 -D CUDA_DOUBLE_MATH_FUNCTIONS -D __CUDACC__ -D __NVCC__ -D __CUDACC_VER_MAJOR__=11 -D __CUDACC_VER_MINOR__=8 -D __CUDACC_VER_BUILD__=89 -D __CUDA_API_VER_MAJOR__=11 -D __CUDA_API_VER_MINOR__=8 -D __NVCC_DIAG_PRAGMA_SUPPORT__=1 -include cuda_runtime.h /usr/share/cmake-3.26/Modules/CMakeCUDACompilerABI.cu -o /tmp/tmpxft_00076fd8_00000000-7_CMakeCUDACompilerABI.cpp1.ii -m64 -mtune=generic -march=x86-64 -fasynchronous-unwind-tables -fstack-protector-strong -Wformat -Wformat-security -fstack-clash-protection -fcf-protection] | |
| ignore line: [ignoring duplicate directory "/usr/include/x86_64-linux-gnu/c++/9"] | |
| ignore line: [ignoring nonexistent directory "/usr/local/include/x86_64-linux-gnu"] | |
| ignore line: [ignoring nonexistent directory "/usr/lib/gcc/x86_64-linux-gnu/9/include-fixed"] | |
| ignore line: [ignoring nonexistent directory "/usr/lib/gcc/x86_64-linux-gnu/9/../../../../x86_64-linux-gnu/include"] | |
| ignore line: [#include "..." search starts here:] | |
| ignore line: [#include <...> search starts here:] | |
| ignore line: [ /usr/include/c++/9] | |
| ignore line: [ /usr/include/x86_64-linux-gnu/c++/9] | |
| ignore line: [ /usr/include/c++/9/backward] | |
| ignore line: [ /usr/lib/gcc/x86_64-linux-gnu/9/include] | |
| ignore line: [ /usr/local/include] | |
| ignore line: [ /usr/include/x86_64-linux-gnu] | |
| ignore line: [ /usr/include] | |
| ignore line: [End of search list.] | |
| ignore line: [COMPILER_PATH=/usr/lib/gcc/x86_64-linux-gnu/9/:/usr/lib/gcc/x86_64-linux-gnu/9/:/usr/lib/gcc/x86_64-linux-gnu/:/usr/lib/gcc/x86_64-linux-gnu/9/:/usr/lib/gcc/x86_64-linux-gnu/] | |
| ignore line: [LIBRARY_PATH=/usr/lib/gcc/x86_64-linux-gnu/9/:/usr/lib/gcc/x86_64-linux-gnu/9/../../../x86_64-linux-gnu/:/usr/lib/gcc/x86_64-linux-gnu/9/../../../../lib/:/lib/x86_64-linux-gnu/:/lib/../lib/:/usr/lib/x86_64-linux-gnu/:/usr/lib/../lib/:/usr/lib/gcc/x86_64-linux-gnu/9/../../../:/lib/:/usr/lib/] | |
| ignore line: [COLLECT_GCC_OPTIONS='-D' '__CUDA_ARCH__=520' '-D' '__CUDA_ARCH_LIST__=520' '-E' '-D' 'CUDA_DOUBLE_MATH_FUNCTIONS' '-D' '__CUDACC__' '-D' '__NVCC__' '-v' '-D' '__CUDACC_VER_MAJOR__=11' '-D' '__CUDACC_VER_MINOR__=8' '-D' '__CUDACC_VER_BUILD__=89' '-D' '__CUDA_API_VER_MAJOR__=11' '-D' '__CUDA_API_VER_MINOR__=8' '-D' '__NVCC_DIAG_PRAGMA_SUPPORT__=1' '-include' 'cuda_runtime.h' '-m64' '-o' '/tmp/tmpxft_00076fd8_00000000-7_CMakeCUDACompilerABI.cpp1.ii' '-shared-libgcc' '-mtune=generic' '-march=x86-64'] | |
| ignore line: [Using built-in specs.] | |
| ignore line: [COLLECT_GCC=/usr/bin/c++] | |
| ignore line: [OFFLOAD_TARGET_NAMES=nvptx-none:hsa] | |
| ignore line: [OFFLOAD_TARGET_DEFAULT=1] | |
| ignore line: [Target: x86_64-linux-gnu] | |
| ignore line: [Configured with: ../src/configure -v --with-pkgversion='Ubuntu 9.4.0-1ubuntu1~20.04.1' --with-bugurl=file:///usr/share/doc/gcc-9/README.Bugs --enable-languages=c ada c++ go brig d fortran objc obj-c++ gm2 --prefix=/usr --with-gcc-major-version-only --program-suffix=-9 --program-prefix=x86_64-linux-gnu- --enable-shared --enable-linker-build-id --libexecdir=/usr/lib --without-included-gettext --enable-threads=posix --libdir=/usr/lib --enable-nls --enable-clocale=gnu --enable-libstdcxx-debug --enable-libstdcxx-time=yes --with-default-libstdcxx-abi=new --enable-gnu-unique-object --disable-vtable-verify --enable-plugin --enable-default-pie --with-system-zlib --with-target-system-zlib=auto --enable-objc-gc=auto --enable-multiarch --disable-werror --with-arch-32=i686 --with-abi=m64 --with-multilib-list=m32 m64 mx32 --enable-multilib --with-tune=generic --enable-offload-targets=nvptx-none=/build/gcc-9-Av3uEd/gcc-9-9.4.0/debian/tmp-nvptx/usr hsa --without-cuda-driver --enable-checking=release --build=x86_64-linux-gnu --host=x86_64-linux-gnu --target=x86_64-linux-gnu] | |
| ignore line: [Thread model: posix] | |
| ignore line: [gcc version 9.4.0 (Ubuntu 9.4.0-1ubuntu1~20.04.1) ] | |
| ignore line: [COLLECT_GCC_OPTIONS='-D' '__CUDA_ARCH_LIST__=520' '-E' '-D' '__CUDACC__' '-D' '__NVCC__' '-v' '-D' '__CUDACC_VER_MAJOR__=11' '-D' '__CUDACC_VER_MINOR__=8' '-D' '__CUDACC_VER_BUILD__=89' '-D' '__CUDA_API_VER_MAJOR__=11' '-D' '__CUDA_API_VER_MINOR__=8' '-D' '__NVCC_DIAG_PRAGMA_SUPPORT__=1' '-include' 'cuda_runtime.h' '-m64' '-o' '/tmp/tmpxft_00076fd8_00000000-5_CMakeCUDACompilerABI.cpp4.ii' '-shared-libgcc' '-mtune=generic' '-march=x86-64'] | |
| ignore line: [ /usr/lib/gcc/x86_64-linux-gnu/9/cc1plus -E -quiet -v -imultiarch x86_64-linux-gnu -D_GNU_SOURCE -D __CUDA_ARCH_LIST__=520 -D __CUDACC__ -D __NVCC__ -D __CUDACC_VER_MAJOR__=11 -D __CUDACC_VER_MINOR__=8 -D __CUDACC_VER_BUILD__=89 -D __CUDA_API_VER_MAJOR__=11 -D __CUDA_API_VER_MINOR__=8 -D __NVCC_DIAG_PRAGMA_SUPPORT__=1 -include cuda_runtime.h /usr/share/cmake-3.26/Modules/CMakeCUDACompilerABI.cu -o /tmp/tmpxft_00076fd8_00000000-5_CMakeCUDACompilerABI.cpp4.ii -m64 -mtune=generic -march=x86-64 -fasynchronous-unwind-tables -fstack-protector-strong -Wformat -Wformat-security -fstack-clash-protection -fcf-protection] | |
| ignore line: [ignoring duplicate directory "/usr/include/x86_64-linux-gnu/c++/9"] | |
| ignore line: [ignoring nonexistent directory "/usr/local/include/x86_64-linux-gnu"] | |
| ignore line: [ignoring nonexistent directory "/usr/lib/gcc/x86_64-linux-gnu/9/include-fixed"] | |
| ignore line: [ignoring nonexistent directory "/usr/lib/gcc/x86_64-linux-gnu/9/../../../../x86_64-linux-gnu/include"] | |
| ignore line: [#include "..." search starts here:] | |
| ignore line: [#include <...> search starts here:] | |
| ignore line: [ /usr/include/c++/9] | |
| ignore line: [ /usr/include/x86_64-linux-gnu/c++/9] | |
| ignore line: [ /usr/include/c++/9/backward] | |
| ignore line: [ /usr/lib/gcc/x86_64-linux-gnu/9/include] | |
| ignore line: [ /usr/local/include] | |
| ignore line: [ /usr/include/x86_64-linux-gnu] | |
| ignore line: [ /usr/include] | |
| ignore line: [End of search list.] | |
| ignore line: [COMPILER_PATH=/usr/lib/gcc/x86_64-linux-gnu/9/:/usr/lib/gcc/x86_64-linux-gnu/9/:/usr/lib/gcc/x86_64-linux-gnu/:/usr/lib/gcc/x86_64-linux-gnu/9/:/usr/lib/gcc/x86_64-linux-gnu/] | |
| ignore line: [LIBRARY_PATH=/usr/lib/gcc/x86_64-linux-gnu/9/:/usr/lib/gcc/x86_64-linux-gnu/9/../../../x86_64-linux-gnu/:/usr/lib/gcc/x86_64-linux-gnu/9/../../../../lib/:/lib/x86_64-linux-gnu/:/lib/../lib/:/usr/lib/x86_64-linux-gnu/:/usr/lib/../lib/:/usr/lib/gcc/x86_64-linux-gnu/9/../../../:/lib/:/usr/lib/] | |
| ignore line: [COLLECT_GCC_OPTIONS='-D' '__CUDA_ARCH_LIST__=520' '-E' '-D' '__CUDACC__' '-D' '__NVCC__' '-v' '-D' '__CUDACC_VER_MAJOR__=11' '-D' '__CUDACC_VER_MINOR__=8' '-D' '__CUDACC_VER_BUILD__=89' '-D' '__CUDA_API_VER_MAJOR__=11' '-D' '__CUDA_API_VER_MINOR__=8' '-D' '__NVCC_DIAG_PRAGMA_SUPPORT__=1' '-include' 'cuda_runtime.h' '-m64' '-o' '/tmp/tmpxft_00076fd8_00000000-5_CMakeCUDACompilerABI.cpp4.ii' '-shared-libgcc' '-mtune=generic' '-march=x86-64'] | |
| ignore line: [Using built-in specs.] | |
| ignore line: [COLLECT_GCC=/usr/bin/c++] | |
| ignore line: [OFFLOAD_TARGET_NAMES=nvptx-none:hsa] | |
| ignore line: [OFFLOAD_TARGET_DEFAULT=1] | |
| ignore line: [Target: x86_64-linux-gnu] | |
| ignore line: [Configured with: ../src/configure -v --with-pkgversion='Ubuntu 9.4.0-1ubuntu1~20.04.1' --with-bugurl=file:///usr/share/doc/gcc-9/README.Bugs --enable-languages=c ada c++ go brig d fortran objc obj-c++ gm2 --prefix=/usr --with-gcc-major-version-only --program-suffix=-9 --program-prefix=x86_64-linux-gnu- --enable-shared --enable-linker-build-id --libexecdir=/usr/lib --without-included-gettext --enable-threads=posix --libdir=/usr/lib --enable-nls --enable-clocale=gnu --enable-libstdcxx-debug --enable-libstdcxx-time=yes --with-default-libstdcxx-abi=new --enable-gnu-unique-object --disable-vtable-verify --enable-plugin --enable-default-pie --with-system-zlib --with-target-system-zlib=auto --enable-objc-gc=auto --enable-multiarch --disable-werror --with-arch-32=i686 --with-abi=m64 --with-multilib-list=m32 m64 mx32 --enable-multilib --with-tune=generic --enable-offload-targets=nvptx-none=/build/gcc-9-Av3uEd/gcc-9-9.4.0/debian/tmp-nvptx/usr hsa --without-cuda-driver --enable-checking=release --build=x86_64-linux-gnu --host=x86_64-linux-gnu --target=x86_64-linux-gnu] | |
| ignore line: [Thread model: posix] | |
| ignore line: [gcc version 9.4.0 (Ubuntu 9.4.0-1ubuntu1~20.04.1) ] | |
| ignore line: [COLLECT_GCC_OPTIONS='-D' '__CUDA_ARCH__=520' '-D' '__CUDA_ARCH_LIST__=520' '-c' '-D' 'CUDA_DOUBLE_MATH_FUNCTIONS' '-v' '-m64' '-o' 'CMakeFiles/cmTC_2f539.dir/CMakeCUDACompilerABI.cu.o' '-shared-libgcc' '-mtune=generic' '-march=x86-64'] | |
| ignore line: [ /usr/lib/gcc/x86_64-linux-gnu/9/cc1plus -quiet -v -imultiarch x86_64-linux-gnu -D_GNU_SOURCE -D __CUDA_ARCH__=520 -D __CUDA_ARCH_LIST__=520 -D CUDA_DOUBLE_MATH_FUNCTIONS /tmp/tmpxft_00076fd8_00000000-6_CMakeCUDACompilerABI.cudafe1.cpp -quiet -dumpbase tmpxft_00076fd8_00000000-6_CMakeCUDACompilerABI.cudafe1.cpp -m64 -mtune=generic -march=x86-64 -auxbase-strip CMakeFiles/cmTC_2f539.dir/CMakeCUDACompilerABI.cu.o -version -fasynchronous-unwind-tables -fstack-protector-strong -Wformat -Wformat-security -fstack-clash-protection -fcf-protection -o /tmp/ccrXz90j.s] | |
| ignore line: [GNU C++14 (Ubuntu 9.4.0-1ubuntu1~20.04.1) version 9.4.0 (x86_64-linux-gnu)] | |
| ignore line: [ compiled by GNU C version 9.4.0 GMP version 6.2.0 MPFR version 4.0.2 MPC version 1.1.0 isl version isl-0.22.1-GMP] | |
| ignore line: [] | |
| ignore line: [GGC heuristics: --param ggc-min-expand=100 --param ggc-min-heapsize=131072] | |
| ignore line: [ignoring duplicate directory "/usr/include/x86_64-linux-gnu/c++/9"] | |
| ignore line: [ignoring nonexistent directory "/usr/local/include/x86_64-linux-gnu"] | |
| ignore line: [ignoring nonexistent directory "/usr/lib/gcc/x86_64-linux-gnu/9/include-fixed"] | |
| ignore line: [ignoring nonexistent directory "/usr/lib/gcc/x86_64-linux-gnu/9/../../../../x86_64-linux-gnu/include"] | |
| ignore line: [#include "..." search starts here:] | |
| ignore line: [#include <...> search starts here:] | |
| ignore line: [ /usr/include/c++/9] | |
| ignore line: [ /usr/include/x86_64-linux-gnu/c++/9] | |
| ignore line: [ /usr/include/c++/9/backward] | |
| ignore line: [ /usr/lib/gcc/x86_64-linux-gnu/9/include] | |
| ignore line: [ /usr/local/include] | |
| ignore line: [ /usr/include/x86_64-linux-gnu] | |
| ignore line: [ /usr/include] | |
| ignore line: [End of search list.] | |
| ignore line: [GNU C++14 (Ubuntu 9.4.0-1ubuntu1~20.04.1) version 9.4.0 (x86_64-linux-gnu)] | |
| ignore line: [ compiled by GNU C version 9.4.0 GMP version 6.2.0 MPFR version 4.0.2 MPC version 1.1.0 isl version isl-0.22.1-GMP] | |
| ignore line: [] | |
| ignore line: [GGC heuristics: --param ggc-min-expand=100 --param ggc-min-heapsize=131072] | |
| ignore line: [Compiler executable checksum: 65fe925b83d3956b533de4aaba7dace0] | |
| ignore line: [COLLECT_GCC_OPTIONS='-D' '__CUDA_ARCH__=520' '-D' '__CUDA_ARCH_LIST__=520' '-c' '-D' 'CUDA_DOUBLE_MATH_FUNCTIONS' '-v' '-m64' '-o' 'CMakeFiles/cmTC_2f539.dir/CMakeCUDACompilerABI.cu.o' '-shared-libgcc' '-mtune=generic' '-march=x86-64'] | |
| ignore line: [ as -v --64 -o CMakeFiles/cmTC_2f539.dir/CMakeCUDACompilerABI.cu.o /tmp/ccrXz90j.s] | |
| ignore line: [GNU assembler version 2.34 (x86_64-linux-gnu) using BFD version (GNU Binutils for Ubuntu) 2.34] | |
| ignore line: [COMPILER_PATH=/usr/lib/gcc/x86_64-linux-gnu/9/:/usr/lib/gcc/x86_64-linux-gnu/9/:/usr/lib/gcc/x86_64-linux-gnu/:/usr/lib/gcc/x86_64-linux-gnu/9/:/usr/lib/gcc/x86_64-linux-gnu/] | |
| ignore line: [LIBRARY_PATH=/usr/lib/gcc/x86_64-linux-gnu/9/:/usr/lib/gcc/x86_64-linux-gnu/9/../../../x86_64-linux-gnu/:/usr/lib/gcc/x86_64-linux-gnu/9/../../../../lib/:/lib/x86_64-linux-gnu/:/lib/../lib/:/usr/lib/x86_64-linux-gnu/:/usr/lib/../lib/:/usr/lib/gcc/x86_64-linux-gnu/9/../../../:/lib/:/usr/lib/] | |
| ignore line: [COLLECT_GCC_OPTIONS='-D' '__CUDA_ARCH__=520' '-D' '__CUDA_ARCH_LIST__=520' '-c' '-D' 'CUDA_DOUBLE_MATH_FUNCTIONS' '-v' '-m64' '-o' 'CMakeFiles/cmTC_2f539.dir/CMakeCUDACompilerABI.cu.o' '-shared-libgcc' '-mtune=generic' '-march=x86-64'] | |
| ignore line: [Linking CUDA executable cmTC_2f539] | |
| ignore line: [/usr/bin/cmake -E cmake_link_script CMakeFiles/cmTC_2f539.dir/link.txt --verbose=1] | |
| ignore line: [/usr/bin/c++ -v CMakeFiles/cmTC_2f539.dir/CMakeCUDACompilerABI.cu.o -o cmTC_2f539 -lcudadevrt -lcudart_static -lrt -lpthread -ldl -L"/usr/lib/x86_64-linux-gnu/stubs" -L"/usr/lib/x86_64-linux-gnu"] | |
| ignore line: [Using built-in specs.] | |
| ignore line: [COLLECT_GCC=/usr/bin/c++] | |
| ignore line: [COLLECT_LTO_WRAPPER=/usr/lib/gcc/x86_64-linux-gnu/9/lto-wrapper] | |
| ignore line: [OFFLOAD_TARGET_NAMES=nvptx-none:hsa] | |
| ignore line: [OFFLOAD_TARGET_DEFAULT=1] | |
| ignore line: [Target: x86_64-linux-gnu] | |
| ignore line: [Configured with: ../src/configure -v --with-pkgversion='Ubuntu 9.4.0-1ubuntu1~20.04.1' --with-bugurl=file:///usr/share/doc/gcc-9/README.Bugs --enable-languages=c ada c++ go brig d fortran objc obj-c++ gm2 --prefix=/usr --with-gcc-major-version-only --program-suffix=-9 --program-prefix=x86_64-linux-gnu- --enable-shared --enable-linker-build-id --libexecdir=/usr/lib --without-included-gettext --enable-threads=posix --libdir=/usr/lib --enable-nls --enable-clocale=gnu --enable-libstdcxx-debug --enable-libstdcxx-time=yes --with-default-libstdcxx-abi=new --enable-gnu-unique-object --disable-vtable-verify --enable-plugin --enable-default-pie --with-system-zlib --with-target-system-zlib=auto --enable-objc-gc=auto --enable-multiarch --disable-werror --with-arch-32=i686 --with-abi=m64 --with-multilib-list=m32 m64 mx32 --enable-multilib --with-tune=generic --enable-offload-targets=nvptx-none=/build/gcc-9-Av3uEd/gcc-9-9.4.0/debian/tmp-nvptx/usr hsa --without-cuda-driver --enable-checking=release --build=x86_64-linux-gnu --host=x86_64-linux-gnu --target=x86_64-linux-gnu] | |
| ignore line: [Thread model: posix] | |
| ignore line: [gcc version 9.4.0 (Ubuntu 9.4.0-1ubuntu1~20.04.1) ] | |
| ignore line: [COMPILER_PATH=/usr/lib/gcc/x86_64-linux-gnu/9/:/usr/lib/gcc/x86_64-linux-gnu/9/:/usr/lib/gcc/x86_64-linux-gnu/:/usr/lib/gcc/x86_64-linux-gnu/9/:/usr/lib/gcc/x86_64-linux-gnu/] | |
| ignore line: [LIBRARY_PATH=/usr/lib/gcc/x86_64-linux-gnu/9/:/usr/lib/gcc/x86_64-linux-gnu/9/../../../x86_64-linux-gnu/:/usr/lib/gcc/x86_64-linux-gnu/9/../../../../lib/:/lib/x86_64-linux-gnu/:/lib/../lib/:/usr/lib/x86_64-linux-gnu/:/usr/lib/../lib/:/usr/lib/gcc/x86_64-linux-gnu/9/../../../:/lib/:/usr/lib/] | |
| ignore line: [COLLECT_GCC_OPTIONS='-v' '-o' 'cmTC_2f539' '-L/usr/lib/x86_64-linux-gnu/stubs' '-L/usr/lib/x86_64-linux-gnu' '-shared-libgcc' '-mtune=generic' '-march=x86-64'] | |
| link line: [ /usr/lib/gcc/x86_64-linux-gnu/9/collect2 -plugin /usr/lib/gcc/x86_64-linux-gnu/9/liblto_plugin.so -plugin-opt=/usr/lib/gcc/x86_64-linux-gnu/9/lto-wrapper -plugin-opt=-fresolution=/tmp/ccKq0MUL.res -plugin-opt=-pass-through=-lgcc_s -plugin-opt=-pass-through=-lgcc -plugin-opt=-pass-through=-lc -plugin-opt=-pass-through=-lgcc_s -plugin-opt=-pass-through=-lgcc --build-id --eh-frame-hdr -m elf_x86_64 --hash-style=gnu --as-needed -dynamic-linker /lib64/ld-linux-x86-64.so.2 -pie -z now -z relro -o cmTC_2f539 /usr/lib/gcc/x86_64-linux-gnu/9/../../../x86_64-linux-gnu/Scrt1.o /usr/lib/gcc/x86_64-linux-gnu/9/../../../x86_64-linux-gnu/crti.o /usr/lib/gcc/x86_64-linux-gnu/9/crtbeginS.o -L/usr/lib/x86_64-linux-gnu/stubs -L/usr/lib/x86_64-linux-gnu -L/usr/lib/gcc/x86_64-linux-gnu/9 -L/usr/lib/gcc/x86_64-linux-gnu/9/../../../x86_64-linux-gnu -L/usr/lib/gcc/x86_64-linux-gnu/9/../../../../lib -L/lib/x86_64-linux-gnu -L/lib/../lib -L/usr/lib/x86_64-linux-gnu -L/usr/lib/../lib -L/usr/lib/gcc/x86_64-linux-gnu/9/../../.. CMakeFiles/cmTC_2f539.dir/CMakeCUDACompilerABI.cu.o -lcudadevrt -lcudart_static -lrt -lpthread -ldl -lstdc++ -lm -lgcc_s -lgcc -lc -lgcc_s -lgcc /usr/lib/gcc/x86_64-linux-gnu/9/crtendS.o /usr/lib/gcc/x86_64-linux-gnu/9/../../../x86_64-linux-gnu/crtn.o] | |
| arg [/usr/lib/gcc/x86_64-linux-gnu/9/collect2] ==> ignore | |
| arg [-plugin] ==> ignore | |
| arg [/usr/lib/gcc/x86_64-linux-gnu/9/liblto_plugin.so] ==> ignore | |
| arg [-plugin-opt=/usr/lib/gcc/x86_64-linux-gnu/9/lto-wrapper] ==> ignore | |
| arg [-plugin-opt=-fresolution=/tmp/ccKq0MUL.res] ==> ignore | |
| arg [-plugin-opt=-pass-through=-lgcc_s] ==> ignore | |
| arg [-plugin-opt=-pass-through=-lgcc] ==> ignore | |
| arg [-plugin-opt=-pass-through=-lc] ==> ignore | |
| arg [-plugin-opt=-pass-through=-lgcc_s] ==> ignore | |
| arg [-plugin-opt=-pass-through=-lgcc] ==> ignore | |
| arg [--build-id] ==> ignore | |
| arg [--eh-frame-hdr] ==> ignore | |
| arg [-m] ==> ignore | |
| arg [elf_x86_64] ==> ignore | |
| arg [--hash-style=gnu] ==> ignore | |
| arg [--as-needed] ==> ignore | |
| arg [-dynamic-linker] ==> ignore | |
| arg [/lib64/ld-linux-x86-64.so.2] ==> ignore | |
| arg [-pie] ==> ignore | |
| arg [-znow] ==> ignore | |
| arg [-zrelro] ==> ignore | |
| arg [-o] ==> ignore | |
| arg [cmTC_2f539] ==> ignore | |
| arg [/usr/lib/gcc/x86_64-linux-gnu/9/../../../x86_64-linux-gnu/Scrt1.o] ==> obj [/usr/lib/gcc/x86_64-linux-gnu/9/../../../x86_64-linux-gnu/Scrt1.o] | |
| arg [/usr/lib/gcc/x86_64-linux-gnu/9/../../../x86_64-linux-gnu/crti.o] ==> obj [/usr/lib/gcc/x86_64-linux-gnu/9/../../../x86_64-linux-gnu/crti.o] | |
| arg [/usr/lib/gcc/x86_64-linux-gnu/9/crtbeginS.o] ==> obj [/usr/lib/gcc/x86_64-linux-gnu/9/crtbeginS.o] | |
| arg [-L/usr/lib/x86_64-linux-gnu/stubs] ==> dir [/usr/lib/x86_64-linux-gnu/stubs] | |
| arg [-L/usr/lib/x86_64-linux-gnu] ==> dir [/usr/lib/x86_64-linux-gnu] | |
| arg [-L/usr/lib/gcc/x86_64-linux-gnu/9] ==> dir [/usr/lib/gcc/x86_64-linux-gnu/9] | |
| arg [-L/usr/lib/gcc/x86_64-linux-gnu/9/../../../x86_64-linux-gnu] ==> dir [/usr/lib/gcc/x86_64-linux-gnu/9/../../../x86_64-linux-gnu] | |
| arg [-L/usr/lib/gcc/x86_64-linux-gnu/9/../../../../lib] ==> dir [/usr/lib/gcc/x86_64-linux-gnu/9/../../../../lib] | |
| arg [-L/lib/x86_64-linux-gnu] ==> dir [/lib/x86_64-linux-gnu] | |
| arg [-L/lib/../lib] ==> dir [/lib/../lib] | |
| arg [-L/usr/lib/x86_64-linux-gnu] ==> dir [/usr/lib/x86_64-linux-gnu] | |
| arg [-L/usr/lib/../lib] ==> dir [/usr/lib/../lib] | |
| arg [-L/usr/lib/gcc/x86_64-linux-gnu/9/../../..] ==> dir [/usr/lib/gcc/x86_64-linux-gnu/9/../../..] | |
| arg [CMakeFiles/cmTC_2f539.dir/CMakeCUDACompilerABI.cu.o] ==> ignore | |
| arg [-lcudadevrt] ==> lib [cudadevrt] | |
| arg [-lcudart_static] ==> lib [cudart_static] | |
| arg [-lrt] ==> lib [rt] | |
| arg [-lpthread] ==> lib [pthread] | |
| arg [-ldl] ==> lib [dl] | |
| arg [-lstdc++] ==> lib [stdc++] | |
| arg [-lm] ==> lib [m] | |
| arg [-lgcc_s] ==> lib [gcc_s] | |
| arg [-lgcc] ==> lib [gcc] | |
| arg [-lc] ==> lib [c] | |
| arg [-lgcc_s] ==> lib [gcc_s] | |
| arg [-lgcc] ==> lib [gcc] | |
| arg [/usr/lib/gcc/x86_64-linux-gnu/9/crtendS.o] ==> obj [/usr/lib/gcc/x86_64-linux-gnu/9/crtendS.o] | |
| arg [/usr/lib/gcc/x86_64-linux-gnu/9/../../../x86_64-linux-gnu/crtn.o] ==> obj [/usr/lib/gcc/x86_64-linux-gnu/9/../../../x86_64-linux-gnu/crtn.o] | |
| collapse obj [/usr/lib/gcc/x86_64-linux-gnu/9/../../../x86_64-linux-gnu/Scrt1.o] ==> [/usr/lib/x86_64-linux-gnu/Scrt1.o] | |
| collapse obj [/usr/lib/gcc/x86_64-linux-gnu/9/../../../x86_64-linux-gnu/crti.o] ==> [/usr/lib/x86_64-linux-gnu/crti.o] | |
| collapse obj [/usr/lib/gcc/x86_64-linux-gnu/9/../../../x86_64-linux-gnu/crtn.o] ==> [/usr/lib/x86_64-linux-gnu/crtn.o] | |
| collapse library dir [/usr/lib/x86_64-linux-gnu/stubs] ==> [/usr/lib/x86_64-linux-gnu/stubs] | |
| collapse library dir [/usr/lib/x86_64-linux-gnu] ==> [/usr/lib/x86_64-linux-gnu] | |
| collapse library dir [/usr/lib/gcc/x86_64-linux-gnu/9] ==> [/usr/lib/gcc/x86_64-linux-gnu/9] | |
| collapse library dir [/usr/lib/gcc/x86_64-linux-gnu/9/../../../x86_64-linux-gnu] ==> [/usr/lib/x86_64-linux-gnu] | |
| collapse library dir [/usr/lib/gcc/x86_64-linux-gnu/9/../../../../lib] ==> [/usr/lib] | |
| collapse library dir [/lib/x86_64-linux-gnu] ==> [/lib/x86_64-linux-gnu] | |
| collapse library dir [/lib/../lib] ==> [/lib] | |
| collapse library dir [/usr/lib/x86_64-linux-gnu] ==> [/usr/lib/x86_64-linux-gnu] | |
| collapse library dir [/usr/lib/../lib] ==> [/usr/lib] | |
| collapse library dir [/usr/lib/gcc/x86_64-linux-gnu/9/../../..] ==> [/usr/lib] | |
| implicit libs: [cudadevrt;cudart_static;rt;pthread;dl;stdc++;m;gcc_s;gcc;c;gcc_s;gcc] | |
| implicit objs: [/usr/lib/x86_64-linux-gnu/Scrt1.o;/usr/lib/x86_64-linux-gnu/crti.o;/usr/lib/gcc/x86_64-linux-gnu/9/crtbeginS.o;/usr/lib/gcc/x86_64-linux-gnu/9/crtendS.o;/usr/lib/x86_64-linux-gnu/crtn.o] | |
| implicit dirs: [/usr/lib/x86_64-linux-gnu/stubs;/usr/lib/x86_64-linux-gnu;/usr/lib/gcc/x86_64-linux-gnu/9;/usr/lib;/lib/x86_64-linux-gnu;/lib] | |
| implicit fwks: [] | |
| - | |
| kind: "try_compile-v1" | |
| backtrace: | |
| - "/usr/share/cmake-3.26/Modules/Internal/CheckSourceCompiles.cmake:101 (try_compile)" | |
| - "/usr/share/cmake-3.26/Modules/Internal/CheckCompilerFlag.cmake:18 (cmake_check_source_compiles)" | |
| - "/usr/share/cmake-3.26/Modules/CheckCXXCompilerFlag.cmake:40 (cmake_check_compiler_flag)" | |
| - "dependencies/cub/cmake/AppendOptionIfAvailable.cmake:7 (check_cxx_compiler_flag)" | |
| - "dependencies/cub/cmake/CubBuildCompilerTargets.cmake:42 (append_option_if_available)" | |
| - "dependencies/cub/cmake/CubBuildTargetList.cmake:221 (cub_build_compiler_targets)" | |
| - "dependencies/cub/CMakeLists.txt:105 (cub_build_target_list)" | |
| checks: | |
| - "Performing Test CXX_FLAG__Wreorder" | |
| directories: | |
| source: "/home/ubuntu/thrust/build/CMakeFiles/CMakeScratch/TryCompile-wRSJbA" | |
| binary: "/home/ubuntu/thrust/build/CMakeFiles/CMakeScratch/TryCompile-wRSJbA" | |
| cmakeVariables: | |
| CMAKE_CXX_FLAGS: "" | |
| CMAKE_CXX_FLAGS_DEBUG: "-g" | |
| CMAKE_EXE_LINKER_FLAGS: "" | |
| buildResult: | |
| variable: "CXX_FLAG__Wreorder" | |
| cached: true | |
| stdout: | | |
| Change Dir: /home/ubuntu/thrust/build/CMakeFiles/CMakeScratch/TryCompile-wRSJbA | |
| Run Build Command(s):/usr/bin/cmake -E env VERBOSE=1 /usr/bin/make -f Makefile cmTC_006e9/fast && /usr/bin/make -f CMakeFiles/cmTC_006e9.dir/build.make CMakeFiles/cmTC_006e9.dir/build | |
| make[1]: Entering directory '/home/ubuntu/thrust/build/CMakeFiles/CMakeScratch/TryCompile-wRSJbA' | |
| Building CXX object CMakeFiles/cmTC_006e9.dir/src.cxx.o | |
| /usr/bin/c++ -DCXX_FLAG__Wreorder -Wreorder -o CMakeFiles/cmTC_006e9.dir/src.cxx.o -c /home/ubuntu/thrust/build/CMakeFiles/CMakeScratch/TryCompile-wRSJbA/src.cxx | |
| Linking CXX executable cmTC_006e9 | |
| /usr/bin/cmake -E cmake_link_script CMakeFiles/cmTC_006e9.dir/link.txt --verbose=1 | |
| /usr/bin/c++ CMakeFiles/cmTC_006e9.dir/src.cxx.o -o cmTC_006e9 | |
| make[1]: Leaving directory '/home/ubuntu/thrust/build/CMakeFiles/CMakeScratch/TryCompile-wRSJbA' | |
| exitCode: 0 | |
| - | |
| kind: "try_compile-v1" | |
| backtrace: | |
| - "/usr/share/cmake-3.26/Modules/Internal/CheckSourceCompiles.cmake:101 (try_compile)" | |
| - "/usr/share/cmake-3.26/Modules/CheckCXXSourceCompiles.cmake:76 (cmake_check_source_compiles)" | |
| - "/usr/share/cmake-3.26/Modules/FindThreads.cmake:99 (CHECK_CXX_SOURCE_COMPILES)" | |
| - "/usr/share/cmake-3.26/Modules/FindThreads.cmake:163 (_threads_check_libc)" | |
| - "/usr/share/cmake-3.26/Modules/FindCUDAToolkit.cmake:1043 (find_package)" | |
| - "dependencies/cub/test/CMakeLists.txt:19 (find_package)" | |
| checks: | |
| - "Performing Test CMAKE_HAVE_LIBC_PTHREAD" | |
| directories: | |
| source: "/home/ubuntu/thrust/build/CMakeFiles/CMakeScratch/TryCompile-zgubQC" | |
| binary: "/home/ubuntu/thrust/build/CMakeFiles/CMakeScratch/TryCompile-zgubQC" | |
| cmakeVariables: | |
| CMAKE_CXX_FLAGS: "" | |
| CMAKE_CXX_FLAGS_DEBUG: "-g" | |
| CMAKE_EXE_LINKER_FLAGS: "" | |
| CMAKE_MODULE_PATH: "/home/ubuntu/thrust/build/CPM_modules;" | |
| buildResult: | |
| variable: "CMAKE_HAVE_LIBC_PTHREAD" | |
| cached: true | |
| stdout: | | |
| Change Dir: /home/ubuntu/thrust/build/CMakeFiles/CMakeScratch/TryCompile-zgubQC | |
| Run Build Command(s):/usr/bin/cmake -E env VERBOSE=1 /usr/bin/make -f Makefile cmTC_e28f9/fast && /usr/bin/make -f CMakeFiles/cmTC_e28f9.dir/build.make CMakeFiles/cmTC_e28f9.dir/build | |
| make[1]: Entering directory '/home/ubuntu/thrust/build/CMakeFiles/CMakeScratch/TryCompile-zgubQC' | |
| Building CXX object CMakeFiles/cmTC_e28f9.dir/src.cxx.o | |
| /usr/bin/c++ -DCMAKE_HAVE_LIBC_PTHREAD -o CMakeFiles/cmTC_e28f9.dir/src.cxx.o -c /home/ubuntu/thrust/build/CMakeFiles/CMakeScratch/TryCompile-zgubQC/src.cxx | |
| Linking CXX executable cmTC_e28f9 | |
| /usr/bin/cmake -E cmake_link_script CMakeFiles/cmTC_e28f9.dir/link.txt --verbose=1 | |
| /usr/bin/c++ CMakeFiles/cmTC_e28f9.dir/src.cxx.o -o cmTC_e28f9 | |
| /usr/bin/ld: CMakeFiles/cmTC_e28f9.dir/src.cxx.o: in function `main': | |
| src.cxx:(.text+0x46): undefined reference to `pthread_create' | |
| /usr/bin/ld: src.cxx:(.text+0x52): undefined reference to `pthread_detach' | |
| /usr/bin/ld: src.cxx:(.text+0x5e): undefined reference to `pthread_cancel' | |
| /usr/bin/ld: src.cxx:(.text+0x6f): undefined reference to `pthread_join' | |
| collect2: error: ld returned 1 exit status | |
| make[1]: *** [CMakeFiles/cmTC_e28f9.dir/build.make:99: cmTC_e28f9] Error 1 | |
| make[1]: Leaving directory '/home/ubuntu/thrust/build/CMakeFiles/CMakeScratch/TryCompile-zgubQC' | |
| make: *** [Makefile:127: cmTC_e28f9/fast] Error 2 | |
| exitCode: 2 | |
| - | |
| kind: "try_compile-v1" | |
| backtrace: | |
| - "/usr/share/cmake-3.26/Modules/CheckLibraryExists.cmake:71 (try_compile)" | |
| - "/usr/share/cmake-3.26/Modules/FindThreads.cmake:112 (CHECK_LIBRARY_EXISTS)" | |
| - "/usr/share/cmake-3.26/Modules/FindThreads.cmake:175 (_threads_check_lib)" | |
| - "/usr/share/cmake-3.26/Modules/FindCUDAToolkit.cmake:1043 (find_package)" | |
| - "dependencies/cub/test/CMakeLists.txt:19 (find_package)" | |
| checks: | |
| - "Looking for pthread_create in pthreads" | |
| directories: | |
| source: "/home/ubuntu/thrust/build/CMakeFiles/CMakeScratch/TryCompile-7s4qHC" | |
| binary: "/home/ubuntu/thrust/build/CMakeFiles/CMakeScratch/TryCompile-7s4qHC" | |
| cmakeVariables: | |
| CMAKE_CXX_FLAGS: "" | |
| CMAKE_CXX_FLAGS_DEBUG: "-g" | |
| CMAKE_EXE_LINKER_FLAGS: "" | |
| CMAKE_MODULE_PATH: "/home/ubuntu/thrust/build/CPM_modules;" | |
| buildResult: | |
| variable: "CMAKE_HAVE_PTHREADS_CREATE" | |
| cached: true | |
| stdout: | | |
| Change Dir: /home/ubuntu/thrust/build/CMakeFiles/CMakeScratch/TryCompile-7s4qHC | |
| Run Build Command(s):/usr/bin/cmake -E env VERBOSE=1 /usr/bin/make -f Makefile cmTC_fc60a/fast && /usr/bin/make -f CMakeFiles/cmTC_fc60a.dir/build.make CMakeFiles/cmTC_fc60a.dir/build | |
| make[1]: Entering directory '/home/ubuntu/thrust/build/CMakeFiles/CMakeScratch/TryCompile-7s4qHC' | |
| Building CXX object CMakeFiles/cmTC_fc60a.dir/CheckFunctionExists.cxx.o | |
| /usr/bin/c++ -DCHECK_FUNCTION_EXISTS=pthread_create -o CMakeFiles/cmTC_fc60a.dir/CheckFunctionExists.cxx.o -c /home/ubuntu/thrust/build/CMakeFiles/CMakeScratch/TryCompile-7s4qHC/CheckFunctionExists.cxx | |
| Linking CXX executable cmTC_fc60a | |
| /usr/bin/cmake -E cmake_link_script CMakeFiles/cmTC_fc60a.dir/link.txt --verbose=1 | |
| /usr/bin/c++ -DCHECK_FUNCTION_EXISTS=pthread_create CMakeFiles/cmTC_fc60a.dir/CheckFunctionExists.cxx.o -o cmTC_fc60a -lpthreads | |
| /usr/bin/ld: cannot find -lpthreads | |
| collect2: error: ld returned 1 exit status | |
| make[1]: *** [CMakeFiles/cmTC_fc60a.dir/build.make:99: cmTC_fc60a] Error 1 | |
| make[1]: Leaving directory '/home/ubuntu/thrust/build/CMakeFiles/CMakeScratch/TryCompile-7s4qHC' | |
| make: *** [Makefile:127: cmTC_fc60a/fast] Error 2 | |
| exitCode: 2 | |
| - | |
| kind: "try_compile-v1" | |
| backtrace: | |
| - "/usr/share/cmake-3.26/Modules/CheckLibraryExists.cmake:71 (try_compile)" | |
| - "/usr/share/cmake-3.26/Modules/FindThreads.cmake:112 (CHECK_LIBRARY_EXISTS)" | |
| - "/usr/share/cmake-3.26/Modules/FindThreads.cmake:176 (_threads_check_lib)" | |
| - "/usr/share/cmake-3.26/Modules/FindCUDAToolkit.cmake:1043 (find_package)" | |
| - "dependencies/cub/test/CMakeLists.txt:19 (find_package)" | |
| checks: | |
| - "Looking for pthread_create in pthread" | |
| directories: | |
| source: "/home/ubuntu/thrust/build/CMakeFiles/CMakeScratch/TryCompile-yRlpmC" | |
| binary: "/home/ubuntu/thrust/build/CMakeFiles/CMakeScratch/TryCompile-yRlpmC" | |
| cmakeVariables: | |
| CMAKE_CXX_FLAGS: "" | |
| CMAKE_CXX_FLAGS_DEBUG: "-g" | |
| CMAKE_EXE_LINKER_FLAGS: "" | |
| CMAKE_MODULE_PATH: "/home/ubuntu/thrust/build/CPM_modules;" | |
| buildResult: | |
| variable: "CMAKE_HAVE_PTHREAD_CREATE" | |
| cached: true | |
| stdout: | | |
| Change Dir: /home/ubuntu/thrust/build/CMakeFiles/CMakeScratch/TryCompile-yRlpmC | |
| Run Build Command(s):/usr/bin/cmake -E env VERBOSE=1 /usr/bin/make -f Makefile cmTC_d0016/fast && /usr/bin/make -f CMakeFiles/cmTC_d0016.dir/build.make CMakeFiles/cmTC_d0016.dir/build | |
| make[1]: Entering directory '/home/ubuntu/thrust/build/CMakeFiles/CMakeScratch/TryCompile-yRlpmC' | |
| Building CXX object CMakeFiles/cmTC_d0016.dir/CheckFunctionExists.cxx.o | |
| /usr/bin/c++ -DCHECK_FUNCTION_EXISTS=pthread_create -o CMakeFiles/cmTC_d0016.dir/CheckFunctionExists.cxx.o -c /home/ubuntu/thrust/build/CMakeFiles/CMakeScratch/TryCompile-yRlpmC/CheckFunctionExists.cxx | |
| Linking CXX executable cmTC_d0016 | |
| /usr/bin/cmake -E cmake_link_script CMakeFiles/cmTC_d0016.dir/link.txt --verbose=1 | |
| /usr/bin/c++ -DCHECK_FUNCTION_EXISTS=pthread_create CMakeFiles/cmTC_d0016.dir/CheckFunctionExists.cxx.o -o cmTC_d0016 -lpthread | |
| make[1]: Leaving directory '/home/ubuntu/thrust/build/CMakeFiles/CMakeScratch/TryCompile-yRlpmC' | |
| exitCode: 0 | |
| ... | |