runtime error
Exit code: 1. Reason: -Xcudafe --diag_suppress=cc_clobber_ignored,--diag_suppress=field_without_dll_interface,--diag_suppress=base_class_has_different_dll_interface,--diag_suppress=dll_interface_conflict_none_assumed,--diag_suppress=dll_interface_conflict_dllexport_assumed,--diag_suppress=bad_friend_decl --expt-relaxed-constexpr --expt-extended-lambda -O3 -DNDEBUG -std=c++20 -Xcompiler=-fPIC -MD -MT cxx/CMakeFiles/torchmcubes_module.dir/mcubes_cuda.cu.o -MF cxx/CMakeFiles/torchmcubes_module.dir/mcubes_cuda.cu.o.d -x cu -c /tmp/pip-req-build-4qkctghf/cxx/mcubes_cuda.cu -o cxx/CMakeFiles/torchmcubes_module.dir/mcubes_cuda.cu.o /tmp/pip-req-build-4qkctghf/cxx/helper_math.h:877:44: error: ‘float lerp(float, float, float)’ conflicts with a previous declaration 877 | inline __device__ __host__ float lerp(float a, float b, float t) { | ^ /usr/include/c++/12/cmath:1911:17: note: previous declaration ‘constexpr float std::lerp(float, float, float)’ 1911 | lerp(float __a, float __b, float __t) noexcept | ^~~~ ninja: build stopped: subcommand failed. *** CMake build failed FAILURE!! [end of output] note: This error originates from a subprocess, and is likely not a problem with pip. ERROR: Failed building wheel for torchmcubes Failed to build torchmcubes [notice] A new release of pip is available: 26.1.2 -> 26.2.1 [notice] To update, run: pip install --upgrade pip error: failed-wheel-build-for-install × Failed to build installable wheels for some pyproject.toml based projects ╰─> torchmcubes Traceback (most recent call last): File "/home/user/app/app.py", line 15, in <module> subprocess.run( File "/usr/local/lib/python3.10/subprocess.py", line 526, in run raise CalledProcessError(retcode, process.args, subprocess.CalledProcessError: Command '['pip', 'install', '--no-build-isolation', 'git+https://github.com/tatsy/torchmcubes.git']' returned non-zero exit status 1.
Container logs:
Fetching error logs...